program: Gaussian 09
title: 000239543
version: EM64L-G09RevD.01
frameworkgroup: C1[X(C12H12Cl2O3)]
method: RPBEPBE
basis: SDD
operation: Freq
keyword: #p
keyword: freq=noraman
keyword: PBEPBE/SDD
title: #p freq=noraman PBEPBE/SDD
converged: YES YES NO NO
title: Mulliken charges:
elementType: Cl Cl O O O C C C C C C C C C C C C H H H H H H H H H H H H
charge: 0.047699 0.061056 -0.281500 -0.211289 -0.174003 -0.561159 0.500555 -0.492740 -0.400214 -0.384715 0.236811 -0.316969 -0.396471 0.355963 -0.765719 0.395227 -0.707884 0.230507 0.240954 0.243282 0.249526 0.240708 0.244290 0.300153 0.257208 0.258838 0.233072 0.241916 0.354898
chargesum: 0.00000
title: Mulliken charges with hydrogens summed into heavy atoms:
elementType: Cl Cl O O O C C C C C C C C C C C C
charge: 0.047699 0.061056 -0.281500 -0.211289 -0.174003 -0.089699 0.500555 0.000068 -0.159506 -0.140424 0.236811 -0.016816 -0.139263 0.355963 -0.031893 0.395227 -0.352986
polarizability: 2.50858205e+02 4.75974955e+00 1.20100960e+02 -7.43953559e+00 1.48095358e+00 1.28790838e+02
1716.lowfreq: -6.4895 -4.0942 -0.0021 -0.0005 0.0012 5.1805 8.7750 15.9105 26.5219
frequency: 2.5781 14.7105 26.4837 29.1379 37.3650 81.1421 84.2355 92.8059 98.4062 144.8819 157.7462 205.1601 224.0628 247.2067 293.3232 305.6213 343.3660 367.1907 411.0696 421.5633 464.8011 494.8222 540.5270 573.1948 598.6697 624.8162 683.0589 700.1103 725.5648 734.4150 741.8255 760.8662 804.7678 825.6461 842.7060 873.3987 909.1355 918.0409 947.6701 963.6056 981.5265 1009.5075 1033.9475 1052.0735 1076.8983 1117.3220 1147.5035 1152.8483 1169.8888 1195.4013 1197.9177 1220.2265 1250.5494 1266.2123 1282.5044 1309.3819 1345.8743 1369.3760 1382.0922 1412.7313 1430.0505 1443.1444 1455.8865 1473.0485 1490.1152 1587.4634 1614.9877 1635.2397 1658.8518 2966.4844 2981.3654 3011.6621 3014.4600 3066.9114 3071.8039 3121.1640 3130.7712 3133.5465 3159.0464 3169.9611 3209.3387
redmass: 12.0133 5.1780 6.7288 6.4174 4.7682 2.0500 4.0588 1.2111 5.8621 12.4259 7.3490 10.4882 9.5093 5.4001 5.8016 14.1406 4.2159 3.2236 2.9819 3.8356 2.0727 6.1563 2.8723 4.8081 12.1390 7.0488 6.0762 7.9149 3.9259 7.8513 1.3728 5.3312 5.2892 1.9300 1.2845 2.1504 1.4258 6.5080 2.1166 1.3538 1.3474 2.9694 1.6498 3.3853 3.0159 1.3858 2.5909 1.3054 2.0368 1.2594 1.0669 2.6493 1.5788 1.2210 1.6597 1.2702 1.6754 1.2384 6.4273 2.9964 1.0835 1.0677 1.0571 1.1057 2.4997 7.1398 6.5368 7.7163 11.3683 1.0607 1.0388 1.0616 1.0954 1.0952 1.1025 1.1004 1.0905 1.0904 1.0891 1.0956 1.0943
irintensity: 0.6777 1.6259 5.5835 0.6085 0.4040 0.1835 1.3301 0.1960 0.5722 0.0435 6.4499 2.7621 2.5076 1.2731 8.3078 0.8907 0.5346 1.7186 0.0066 1.7264 0.8300 10.1406 23.1170 16.8233 79.7896 2.7178 17.3094 31.5633 1.3886 37.4731 5.2801 19.1687 3.5821 44.0696 0.7005 40.6987 4.0881 57.3936 6.0301 1.4246 0.7779 14.1845 7.3685 9.5063 316.0238 9.8484 152.2117 20.1729 48.2104 47.1946 8.9399 7.0843 50.6744 9.4436 71.2957 0.0690 38.4568 59.6397 3.9814 5.8219 22.9061 22.5893 19.1336 16.7941 98.0662 0.4012 6.4935 123.5926 225.6538 11.9055 5.6200 15.7987 5.3044 9.9030 18.0755 15.3677 13.3195 14.9865 0.6935 3.3364 2.9079
temp: 298.150 k
press: 1.00000 atm
elementType: 17 17 8 8 8 6 6 6 6 6 6 6 6 6 6 6 6 1 1 1 1 1 1 1 1 1 1 1 1
symmnumber: 1
zpe: 556950.1 jmol-1
zpe.correction: 0.212131 hartree
zpe.thermalcorrener: 0.230118 hartree
zpe.thermalcorrenthalpy: 0.231062 hartree
zpe.thermalcorrgfe: 0.158553 hartree
zpe.sumelectzpe: -1609.001379 hartree
zpe.sumelectthermal: -1608.983392 hartree
zpe.sumelectthermalent: -1608.982448 hartree
zpe.sumelectthermalfe: -1609.054957 hartree
dipole: -2.2768 2.0305 1.6374
dipole: 3.4624
quadrupole: -133.2191 -114.8217 -108.1563
quadrupole: -18.2631 11.5453 -0.3713
quadrupole: -14.4868 3.9107 10.5761 -18.2631 11.5453 -0.3713
hfenergy: -1609.2135098 hartree
pointgroup: C01 [X(C12H12Cl2O3)]
dipole: 0.857635 0.3765557 -0.9890604 debye
polarizability: 250.4647115|-7.0214403|120.8979669|-8.6499598|3.2488262|128.3873246 unknown
InChI: InChI=1S/C12H12Cl2O3/c1-8(15)2-3-9-4-6-10(7-5-9)17-12(16)11(13)14/h4-7,11H,2-3H2,1H3
charge 0 multiplicity 1
29 atoms
Cl -5.480567 1.615369 -0.848451
Cl -6.250226 -0.699828 1.009359
O  -2.662265 -0.443283 -0.264069
O  5.904428 -0.53055 0.111224
O  -3.445037 0.668106 1.670729
C  3.07698 -0.695075 0.374622
C  1.562729 -0.639132 0.257634
C  3.745977 0.559592 -0.238915
C  0.771567 -0.044258 1.272049
C  0.901706 -1.14942 -0.891345
C  5.277463 0.514139 -0.208493
C  -0.634009 0.057306 1.166938
C  -0.497569 -1.062829 -1.024029
C  -1.250668 -0.457825 0.004674
C  6.002649 1.80388 -0.577322
C  -3.628739 0.12415 0.569387
C  -4.968238 -0.042004 -0.152447
H  3.384083 -0.776843 1.433218
H  3.48077 -1.589137 -0.133159
H  3.401875 1.482991 0.269787
H  3.433756 0.680365 -1.298083
H  1.258758 0.344473 2.174392
H  1.487226 -1.627339 -1.685533
H  -1.22392 0.515521 1.961152
H  -1.014768 -1.457288 -1.903646
H  7.057745 1.595071 -0.813242
H  5.516846 2.31452 -1.428406
H  5.968698 2.502059 0.282233
H  -4.899352 -0.73033 -1.000854
