program: Gaussian 09
title: 000019659
version: EM64L-G09RevD.01
frameworkgroup: C1[X(C5H4NOS)]
method: RPBEPBE
basis: SDD
operation: Freq
keyword: #p
keyword: freq=noraman
keyword: PBEPBE/SDD
title: #p freq=noraman PBEPBE/SDD
converged: NO NO NO YES
title: Mulliken charges:
elementType: S O N C C C C C H H H H
charge: -0.218150 -0.408741 0.034664 -0.285094 -0.273262 -0.219768 -0.241576 -0.245188 0.238436 0.228953 0.191725 0.198002
chargesum: -1.00000
title: Mulliken charges with hydrogens summed into heavy atoms:
elementType: S O N C C C C C
charge: -0.218150 -0.408741 0.034664 -0.285094 -0.034826 0.009184 -0.049851 -0.047186
polarizability: 1.39261187e+02 2.82615847e+00 9.48866835e+01 -1.54621947e-02 -2.93325000e-06 3.21009606e+01
1716.lowfreq: -10.4797 0.0020 0.0030 0.0036 4.6307 7.6812 117.6778 249.7630 252.5106
frequency: 117.6723 249.7624 252.5106 388.7961 437.5637 507.9823 535.7932 563.8624 657.8997 669.3766 709.8707 788.0223 808.8483 859.0041 908.8882 1008.6318 1044.2222 1090.0727 1130.6124 1203.0199 1223.5506 1257.1729 1372.7588 1439.8780 1516.5976 1564.2405 3107.6261 3132.7524 3153.2177 3176.1940
redmass: 5.4564 5.5031 13.4354 10.7535 3.1631 7.1408 4.3048 8.3251 6.3918 3.6863 1.3569 1.3707 6.1687 1.3440 1.2744 2.5794 4.1148 1.7838 1.3739 4.7009 1.5854 2.5496 1.9325 2.6837 6.9805 5.5293 1.0846 1.0909 1.0951 1.0963
irintensity: 0.4540 0.2277 2.0034 1.8906 7.7624 4.7226 1.1692 1.9790 1.4328 5.7796 108.4409 0.0323 46.6280 7.6899 0.9644 8.7989 85.5053 96.9761 11.9671 100.6076 10.4880 18.2479 34.9660 30.6255 31.1334 55.6947 14.2917 34.7939 34.8912 22.0146
temp: 298.150 k
press: 1.00000 atm
elementType: 16 8 7 6 6 6 6 6 1 1 1 1
symmnumber: 1
zpe: 208607.2 jmol-1
zpe.correction: 0.079454 hartree
zpe.thermalcorrener: 0.085972 hartree
zpe.thermalcorrenthalpy: 0.086916 hartree
zpe.thermalcorrgfe: 0.048268 hartree
zpe.sumelectzpe: -720.404165 hartree
zpe.sumelectthermal: -720.397647 hartree
zpe.sumelectthermalent: -720.396703 hartree
zpe.sumelectthermalfe: -720.435351 hartree
dipole: -6.2456 -1.9812 0.0005
dipole: 6.5523
quadrupole: -71.4127 -65.1804 -59.5329
quadrupole: -1.8596 0.0019 0.0007
quadrupole: -6.0374 0.1950 5.8424 -1.8596 0.0019 0.0007
hfenergy: -720.4836194 hartree
pointgroup: C01 [X(C5H4N1O1S1)]
dipole: 2.571003 -0.1882583 -0.0001896 debye
dipolederiv: -1.1236245 -0.3713568 0.0001178 -0.3285248 -0.4641527 0.0000777 0.0003448 0.0001659 -0.4354298 -0.5034922 0.4741724 -0.0000088 0.4471483 -0.9128836 -0.0000412 0.0000214 -0.0001281 -0.3812086 -0.0890889 -0.6826383 0.0000328 -0.9991417 0.3843441 0.0001387 -0.0000134 0.0002094 0.1293752 1.2762596 0.6276877 -0.0002894 0.7209704 -0.0389821 -0.0001457 -0.0003173 -0.0002413 -0.1556385 0.268066 0.1801285 -0.0000172 -0.0997139 0.1189208 0.0000213 -0.0000273 -0.0000382 -0.1846233 -0.3661555 -0.3829698 0.0000842 0.1431882 0.1108024 -0.0000078 -0.0000258 0.000013 -0.1552625 -0.3177427 -0.0762942 0.0000387 0.0433948 -0.1911178 -0.0000041 0.0000702 0.0000422 -0.2683441 0.0313295 0.2557881 0.000029 0.0822047 0.2094407 -0.0000335 -0.0000011 -0.0000365 -0.2307295 0.0474007 -0.0074875 0.0000124 -0.0574216 -0.1042256 -0.000008 -0.0000174 -0.0000115 0.1742822 0.0658426 -0.0556885 0.0000062 -0.0084001 -0.1121486 -0.0000133 0.0000127 0.0000385 0.149685 -0.17355 -0.1036246 -0.0000024 -0.1061841 0.0416123 0.0000019 -0.0000239 0.0000022 0.1850797 -0.1152446 0.142283 -0.0000034 0.1624798 -0.04161 0.000014 -0.0000229 -0.0000156 0.1728142 unknown
polarizability: 138.1491445|7.4897842|95.998726|-0.0150412|-0.0035836|32.1009606 unknown
InChI: InChI=1S/C5H4NOS/c7-6-4-2-1-3-5(6)8/h1-4H
charge -1 multiplicity 1
12 atoms
S  -2.399593 -1.141891 0.000426
O  -1.395586 1.756106 0.000141
N  -0.425661 0.828816 -0.000082
C  -0.743633 -0.586278 -0.000273
C  0.901337 1.251834 -0.000064
C  0.388545 -1.466027 -0.000101
C  1.989374 0.365711 -0.000127
C  1.728685 -1.03026 -0.000081
H  1.003149 2.340028 0.000006
H  0.147316 -2.533898 -0.000033
H  3.006657 0.773245 -0.000106
H  2.54871 -1.758787 -0.000008
