program: Gaussian 09
title: 000239517
version: EM64L-G09RevD.01
frameworkgroup: C1[X(C12H21N3O12S3)]
method: RPBEPBE
basis: SDD
operation: Freq
keyword: #p
keyword: freq=noraman
keyword: PBEPBE/SDD
title: #p freq=noraman PBEPBE/SDD
converged: NO YES NO NO
title: Mulliken charges:
elementType: S S S O O O O O O O O O O O O N N N C C C C C C C C C C C C H H H H H H H H H H H H H H H H H H H H H
charge: 1.083350 1.070983 1.058285 -0.409710 -0.410428 -0.390966 -0.243730 -0.246786 -0.281020 -0.588657 -0.499119 -0.564229 -0.512510 -0.556996 -0.502178 -0.218423 -0.214222 -0.220226 0.282819 0.285493 0.289578 -0.347703 -0.359723 -0.326194 -0.250006 -0.240270 -0.300447 -0.744096 -0.762677 -0.767066 0.272062 0.252477 0.272264 0.253975 0.266822 0.243393 0.275971 0.230311 0.251605 0.243288 0.269045 0.247804 0.344240 0.280727 0.285531 0.380497 0.276275 0.287362 0.313196 0.353370 0.286656
chargesum: 0.00000
title: Mulliken charges with hydrogens summed into heavy atoms:
elementType: S S S O O O O O O O O O O O O N N N C C C C C C C C C C C C
charge: 1.083350 1.070983 1.058285 -0.409710 -0.410428 -0.390966 -0.243730 -0.246786 -0.281020 -0.588657 -0.499119 -0.564229 -0.512510 -0.556996 -0.502178 -0.218423 -0.214222 -0.220226 0.282819 0.285493 0.289578 0.176836 0.166517 0.184022 0.256276 0.254623 0.216401 0.166402 0.181458 0.186156
polarizability: 2.80706370e+02 8.22751532e-01 2.72196112e+02 -3.34681701e+00 -2.71536140e+00 2.51620010e+02
1716.lowfreq: -9.8519 -8.5548 -4.3594 0.0013 0.0014 0.0020 19.6531 25.5475 30.6423
frequency: 19.0489 25.4828 30.5768 36.7955 43.3592 48.9859 51.6909 56.8794 61.4884 69.2900 76.6323 89.5392 91.4139 98.7448 108.6655 118.1797 129.4656 153.0508 171.3175 180.0428 187.7904 201.4113 206.4659 212.5013 214.7613 226.0957 226.8359 232.4901 233.0347 244.0874 252.7953 258.0736 262.3049 295.5207 299.7191 301.0719 318.5991 326.3309 347.4446 351.4174 358.0737 359.5595 360.6389 369.7131 386.4151 397.5164 402.1501 426.4425 442.0985 444.5491 468.3458 492.8573 514.2085 547.6934 581.6547 585.1607 592.0081 600.4531 604.6360 662.6329 702.8809 704.5691 720.5670 751.4824 809.1964 824.5075 830.2954 838.3888 840.7850 844.9717 863.0795 870.7666 911.2216 914.6203 923.4886 957.2407 963.0398 968.0335 992.1421 1009.0471 1013.9561 1023.5552 1025.2241 1039.8329 1048.9364 1052.9732 1063.5140 1068.1290 1074.9494 1079.8161 1144.4960 1153.4029 1156.4177 1212.5997 1224.2046 1235.4480 1250.7976 1300.5360 1306.6637 1319.1417 1331.7990 1336.7497 1340.1178 1343.4545 1347.7673 1351.8687 1363.4185 1365.0007 1372.5535 1398.2296 1404.9127 1411.6289 1414.7344 1415.9430 1426.5503 1431.4333 1435.5973 1438.4272 1438.5912 1440.6382 1443.3911 1477.8412 1478.9893 1597.9553 1612.9454 1670.4879 2984.5915 2993.4287 2995.3200 2997.1983 3003.9396 3010.6260 3037.6307 3037.9644 3038.6561 3065.0948 3070.4690 3077.9310 3114.3508 3117.1281 3117.2154 3134.4980 3144.7723 3154.3647 3179.1567 3187.4847 3187.7994
redmass: 9.8185 7.6060 7.7084 8.8285 10.0051 9.5876 7.6379 7.4652 7.0890 7.9275 7.5412 8.6812 8.5513 8.2716 5.9022 4.9227 5.4055 5.6770 3.1829 3.3561 3.4839 5.2092 1.8025 3.2382 2.0489 3.0926 2.2763 2.4674 2.4100 2.4332 2.2862 3.0115 3.3228 5.9035 6.3118 5.1732 2.3861 3.1398 9.4899 6.8735 6.5984 6.2336 6.1839 3.3567 4.6786 5.6867 7.1268 4.2253 6.8418 9.1358 5.7280 5.6461 4.3336 4.2674 3.8048 3.5901 8.8550 9.3284 9.2590 9.2020 9.9292 10.1987 4.9651 7.8696 3.1848 3.2500 10.4478 11.8487 9.2632 3.6236 3.2589 3.5298 4.0517 3.7468 4.0928 2.2444 2.5923 2.5469 2.3523 1.5383 1.6843 2.6126 2.2583 1.3677 1.6536 1.6102 1.6413 3.1233 2.7827 2.7622 2.6066 2.0992 2.1529 1.6766 1.3442 1.5057 2.1546 1.6284 1.5529 1.3520 1.1307 1.1284 1.1291 1.3225 1.3611 1.2427 1.3946 1.3733 1.3024 2.3118 1.9538 1.0540 1.0452 1.0410 1.1085 1.0936 1.0617 1.1918 1.0518 1.3154 1.0536 1.0865 1.0826 9.9106 10.7835 9.6869 1.0287 1.0543 1.0337 1.0548 1.0282 1.0580 1.0621 1.0628 1.0619 1.1073 1.1061 1.1056 1.1026 1.1026 1.1022 1.1062 1.1028 1.1057 1.1074 1.1076 1.1075
irintensity: 5.2895 2.9193 0.3718 2.8910 1.7186 1.7548 1.3522 1.3369 2.7886 3.4655 2.0454 4.1955 4.9003 0.8746 0.9867 8.8908 11.5455 13.4976 4.8033 3.9982 6.5377 5.4991 2.2797 4.5695 7.3822 6.6794 8.1434 4.7312 6.6082 0.3601 1.4296 1.4199 3.9034 11.7725 11.7653 2.7339 1.0336 3.6080 14.5289 4.2896 12.8998 45.7594 36.8899 5.8697 26.3981 20.9226 40.6115 40.7266 11.8472 1.9410 20.0917 16.0955 74.2115 17.1606 5.9593 39.2479 24.0692 14.2584 53.4700 0.2254 0.1305 0.5438 1.4730 65.9491 3.4787 13.0190 69.5026 57.6503 55.3591 78.2733 21.7350 9.7551 51.1566 95.7873 68.9810 7.1133 33.1861 37.2463 109.6687 15.2951 9.6435 1.2530 9.1412 29.8646 67.8935 52.5904 72.8974 5.2387 6.1757 3.2544 2.9459 7.9163 6.3602 9.3414 11.8817 10.3733 4.0438 83.2018 73.6470 5.8178 18.7469 1.0890 3.1037 12.3777 16.0250 18.5952 43.4747 39.4902 7.4058 166.4139 111.2175 13.9409 16.1199 10.5120 55.1083 60.5310 6.1386 150.9204 11.3817 160.1337 25.1417 27.3455 24.3655 515.5361 550.8999 10.0861 58.7321 46.0008 101.5118 16.4211 94.5752 11.4436 12.7837 11.6248 13.9144 20.9574 17.5211 5.8324 0.3981 1.1348 1.4352 36.5787 56.6608 62.7034 4.1900 0.3472 0.3930
temp: 298.150 k
press: 1.00000 atm
elementType: 16 16 16 8 8 8 8 8 8 8 8 8 8 8 8 7 7 7 6 6 6 6 6 6 6 6 6 6 6 6 1 1 1 1 1 1 1 1 1 1 1 1 1 1 1 1 1 1 1 1 1
symmnumber: 1
zpe: 946436.2 jmol-1
zpe.correction: 0.360479 hartree
zpe.thermalcorrener: 0.395217 hartree
zpe.thermalcorrenthalpy: 0.396161 hartree
zpe.thermalcorrgfe: 0.292290 hartree
zpe.sumelectzpe: -2728.192854 hartree
zpe.sumelectthermal: -2728.158115 hartree
zpe.sumelectthermalent: -2728.157171 hartree
zpe.sumelectthermalfe: -2728.261042 hartree
dipole: -1.1376 -3.5745 -2.6036
dipole: 4.5662
quadrupole: -212.2454 -202.9506 -199.1339
quadrupole: 8.3808 3.5128 2.7864
quadrupole: -7.4688 1.8260 5.6427 8.3808 3.5128 2.7864
hfenergy: -2728.5533327 hartree
pointgroup: C01 [X(C12H21N3O12S3)]
dipole: -0.0328061 0.8419598 1.5866141 debye
polarizability: 276.6114757|2.9242679|271.5786972|-10.4717218|3.6297308|256.3323186 unknown
InChI: InChI=1S/C12H21N3O12S3/c1-28(19,20)25-7-4-13-10(16)14(5-8-26-29(2,21)22)12(18)15(11(13)17)6-9-27-30(3,23)24/h4-9H2,1-3H3
charge 0 multiplicity 1
51 atoms
S  -1.386137 -3.0800 -1.855938
S  3.133718 0.231702 -2.302034
S  -1.374431 2.182978 -1.474626
O  -1.761851 -2.82469 -0.037138
O  2.893108 -0.089778 -0.476706
O  -2.255922 3.148551 -0.120443
O  1.74243 -1.882143 2.125826
O  -2.712115 -0.476248 2.360505
O  0.689209 2.657827 1.678053
O  0.196655 -2.784717 -2.086876
O  -1.992601 -4.486369 -2.366102
O  1.946585 1.203785 -2.834978
O  4.663643 0.694616 -2.555537
O  -0.941274 0.743042 -0.842104
O  -2.278115 2.157799 -2.812586
N  -0.494691 -1.216874 2.139168
N  1.244387 0.403038 1.915401
N  -1.021228 1.111074 2.109092
C  0.890806 -0.960537 2.058568
C  -1.491685 -0.218968 2.201082
C  0.321399 1.465117 1.873142
C  -0.911538 -2.638972 2.20825
C  2.683797 0.73324 1.776719
C  -2.046471 2.183968 2.177339
C  -0.743247 -3.383023 0.873874
C  3.095725 1.117434 0.348878
C  -2.910592 2.316667 0.91045
C  -2.432274 -1.613913 -2.422537
C  2.846967 -1.563522 -2.809289
C  0.099006 3.35786 -1.624764
H  -1.967044 -2.648862 2.521124
H  -0.290244 -3.148737 2.965151
H  3.244312 -0.155947 2.104454
H  2.91004 1.587317 2.438433
H  -1.514804 3.130031 2.365214
H  -2.709241 1.950953 3.028943
H  0.272461 -3.236058 0.461831
H  -0.928955 -4.461482 1.037484
H  2.479887 1.955709 -0.022186
H  4.163854 1.408429 0.34999
H  -3.192219 1.322077 0.519255
H  -3.836663 2.869827 1.150838
H  -1.987448 -0.739209 -1.922761
H  -2.3436 -1.582196 -3.517318
H  -3.454582 -1.831665 -2.08583
H  1.836785 -1.843617 -2.46809
H  2.947707 -1.576642 -3.903536
H  3.637694 -2.132731 -2.303027
H  0.437091 3.51354 -0.590026
H  0.831855 2.818668 -2.249539
H  -0.303549 4.270648 -2.083894
