program: Gaussian 09
title: 000239513
version: EM64L-G09RevD.01
frameworkgroup: C1[X(C10H12ClNS2)]
method: RPBEPBE
basis: SDD
operation: Freq
keyword: #p
keyword: freq=noraman
keyword: PBEPBE/SDD
title: #p freq=noraman PBEPBE/SDD
converged: YES YES NO NO
title: Mulliken charges:
elementType: Cl S S N C C C C C C C C C C H H H H H H H H H H H H
charge: -0.057604 0.179850 0.007589 -0.003472 0.492541 -0.799283 -0.356167 -0.368550 -0.433682 -0.207009 -0.207174 -0.100574 -0.603294 -0.617626 0.296782 0.304376 0.246481 0.243951 0.256343 0.256490 0.264652 0.264596 0.201813 0.220693 0.259497 0.258779
chargesum: 0.00000
title: Mulliken charges with hydrogens summed into heavy atoms:
elementType: Cl S S N C C C C C C C C C C
charge: -0.057604 0.179850 0.007589 -0.003472 0.492541 -0.198125 -0.109686 -0.124599 -0.433682 0.049334 0.049316 -0.100574 0.127767 0.121344
polarizability: 2.59720458e+02 -1.12210476e+01 1.29901728e+02 -2.48270494e+00 3.47087124e-02 1.13250898e+02
1716.lowfreq: -4.8724 -1.5006 -0.0022 0.0004 0.0010 2.9925 8.6177 26.1272 35.4208
frequency: 8.1761 26.0868 35.3905 40.1272 68.1273 73.9487 113.3052 120.3518 146.0097 229.7144 234.2392 238.2931 296.4016 324.6888 349.4213 375.8121 407.7705 410.4920 433.6135 497.4546 534.2534 556.0122 625.9768 630.7720 652.5801 728.2161 802.2910 829.6922 839.0908 845.5131 887.8995 953.1326 955.0400 966.6963 1000.7833 1044.7860 1071.6360 1091.9045 1093.2836 1119.4666 1130.4732 1139.2770 1184.3052 1216.7894 1243.8965 1251.9832 1295.9438 1369.0344 1376.9419 1395.1233 1423.6720 1442.0512 1442.2998 1464.5086 1466.0462 1475.4408 1477.7948 1501.2514 1585.9838 1600.4672 2975.9089 2989.1449 3043.0092 3053.4359 3071.2693 3111.0075 3118.8625 3122.6959 3137.2886 3139.3077 3170.3775 3173.8508
redmass: 6.0385 3.0697 2.8053 1.9828 2.7508 1.5907 7.8787 1.8453 9.8942 4.5500 3.8695 3.6035 6.3519 7.0848 2.6927 7.9310 3.0184 6.2198 3.9792 3.4446 9.2230 4.2232 6.8449 6.0200 5.6459 3.3113 4.1733 1.2469 2.0598 3.3680 1.5423 1.4305 4.4187 1.3738 4.2462 1.6190 2.7613 1.2400 1.2695 1.3457 1.0961 1.6810 1.1198 2.0498 1.5362 3.8754 1.2671 3.1054 7.1295 2.9053 1.1260 1.0419 1.1081 1.2022 1.0606 1.0649 2.4506 1.2331 7.4386 6.2861 1.0353 1.0341 1.0581 1.1012 1.1012 1.1014 1.1080 1.0983 1.0900 1.0899 1.0954 1.0964
irintensity: 0.2126 1.0510 0.5100 0.3507 3.2432 2.9331 2.0053 0.0130 1.4444 0.8789 2.9740 3.2782 2.6861 1.7758 0.9294 3.3793 3.7833 35.4717 7.8812 24.4910 0.0491 8.7659 0.1249 1.8059 22.3565 13.4033 32.8259 0.0432 45.2242 37.4820 1.8694 12.4994 193.0650 0.1137 33.7734 14.6043 44.8758 0.8851 5.9843 2.0342 4.3698 22.5656 0.4833 0.3560 24.7073 48.2422 0.2361 128.3483 0.2670 5.6821 9.6389 4.7851 16.2075 9.6136 23.2122 11.0317 72.2248 184.9550 1.2573 16.3171 27.6457 46.5906 4.1236 16.2171 20.0778 4.4877 2.7557 42.9989 7.1589 8.7491 6.5403 0.6385
temp: 298.150 k
press: 1.00000 atm
elementType: 17 16 16 7 6 6 6 6 6 6 6 6 6 6 1 1 1 1 1 1 1 1 1 1 1 1
symmnumber: 1
zpe: 515877.0 jmol-1
zpe.correction: 0.196487 hartree
zpe.thermalcorrener: 0.212378 hartree
zpe.thermalcorrenthalpy: 0.213322 hartree
zpe.thermalcorrgfe: 0.148237 hartree
zpe.sumelectzpe: -1698.154989 hartree
zpe.sumelectthermal: -1698.139097 hartree
zpe.sumelectthermalent: -1698.138153 hartree
zpe.sumelectthermalfe: -1698.203239 hartree
dipole: 2.8412 2.8615 0.1659
dipole: 4.0359
quadrupole: -102.2184 -107.0505 -98.7182
quadrupole: 16.7709 -0.8875 -0.6272
quadrupole: 0.4439 -4.3881 3.9442 16.7709 -0.8875 -0.6272
hfenergy: -1698.3514758 hartree
pointgroup: C01 [X(C10H12Cl1N1S2)]
dipole: -1.1781092 -0.7267352 0.7778954 debye
dipolederiv: -0.9146506 0.119875 -0.1741019 0.1586195 -0.1280254 0.00404 -0.2035502 0.0004815 -0.1394912 -1.0479378 0.0689902 -0.2555405 0.1770784 -0.0981924 0.0624628 -0.397936 0.0502929 -0.2079768 -0.4940171 0.0447727 -0.1084995 0.1053145 -0.4576249 0.3281955 -0.1753413 0.3254246 -0.6298856 -1.1699223 -0.3352123 0.2240253 -0.3121211 -0.5247093 0.3520269 0.1593574 0.3566452 -0.5780271 0.2207087 0.0088083 0.0189113 -0.0187425 -0.075843 0.016208 0.0260378 0.0138753 -0.0595089 0.6145042 0.0541075 -0.0011747 0.1966952 0.1490249 -0.0051667 -0.2244842 -0.0159117 0.0739631 -0.01496 0.0006542 0.070236 -0.0449929 -0.013755 0.0813019 0.0028663 0.0939131 -0.0274152 -0.0187562 -0.0798648 0.0055673 -0.0070408 0.0012649 0.0963403 0.0652169 0.08655 -0.0345188 1.5298602 0.2356488 0.0425326 -0.0338161 0.4629109 -0.7122972 0.4513458 -0.6801406 0.7630608 -0.3437955 -0.0348756 -0.0996528 -0.0450056 -0.0273565 0.0533384 -0.1277631 0.0459142 -0.0951755 -0.360396 0.0901896 0.0075453 0.1342923 -0.0718172 0.0602143 0.0147402 0.0606615 -0.0441424 1.2467205 -0.216174 0.2934712 -0.2524506 0.0869575 0.043867 0.312614 0.0472735 0.0891811 0.4391443 0.0544801 -0.0123794 -0.0586006 0.1679384 0.0121642 0.1200285 0.0335164 0.1651294 0.025587 -0.0700686 0.044187 0.0261255 0.28024 -0.0787093 -0.0789217 -0.1001665 0.3085603 -0.0234672 -0.0026532 0.0024772 -0.0318722 -0.056319 -0.0053169 0.092739 -0.0029314 0.056382 0.0335914 -0.0047228 -0.008684 -0.0949689 0.0423298 -0.0130539 0.0720783 -0.0060537 -0.0203112 0.0510855 -0.0358601 -0.0844589 -0.0399824 0.0597403 -0.075427 -0.085732 -0.080678 0.0358232 0.0402445 0.0967357 0.0275778 0.0926751 0.0183149 -0.0735014 0.0282238 -0.0669967 0.084801 0.047257 0.0694541 0.0208009 0.0772418 0.0475179 -0.075067 0.0145362 -0.0726868 0.1051948 0.0523554 -0.0314369 -0.065311 -0.0237703 0.0810486 -0.080918 -0.0745121 -0.0840312 0.0666619 0.0307628 0.002247 0.0317626 0.0315378 0.0686863 -0.0375531 -0.0963745 -0.0861282 -0.0688521 0.0214682 -0.0036762 0.0048061 0.1210388 -0.0693774 -0.0342091 -0.0579673 -0.02012 0.0802797 -0.0200538 -0.0635592 0.0477874 -0.1427774 0.0215637 0.0890815 0.1438341 0.1062501 0.022443 -0.1314607 -0.1130455 0.100309 -0.0518785 0.0809286 0.0446633 0.016376 0.031265 0.0911281 0.1133593 -0.0017688 -0.1198937 -0.0482682 -0.0009094 -0.0653072 -0.0571976 -0.0148818 -0.0511021 0.0727682 0.1469547 -0.0123006 0.0856691 -0.0445371 0.0126229 0.0597858 -0.0213369 0.0137988 unknown
polarizability: 256.9851341|-2.2336268|120.5110922|22.2174068|-8.3141934|125.3768578 unknown
InChI: InChI=1S/C10H12ClNS2/c1-12(2)10(13)14-7-8-3-5-9(11)6-4-8/h3-6H,7H2,1-2H3
charge 0 multiplicity 1
26 atoms
Cl 5.73691 -0.514279 0.577151
S  -1.272187 -0.506491 0.196294
S  -3.122045 0.889246 -1.926991
N  -3.949164 -0.83959 0.013378
C  1.298842 0.324774 -0.509083
C  -0.139415 0.602867 -0.871154
C  2.011281 -0.730982 -1.135781
C  1.96961 1.116551 0.458373
C  -2.920598 -0.160373 -0.592239
C  3.360191 -0.993547 -0.812563
C  3.319185 0.870252 0.795701
C  3.993002 -0.185469 0.152342
C  -5.321308 -0.668005 -0.516186
C  -3.722325 -1.738157 1.168023
H  -0.444054 1.641489 -0.672113
H  -0.386762 0.362242 -1.916906
H  1.508437 -1.353968 -1.884135
H  1.435295 1.935584 0.953309
H  3.907203 -1.805306 -1.300478
H  3.833386 1.486003 1.539172
H  -5.366056 -0.970303 -1.577637
H  -5.62487 0.392824 -0.464325
H  -6.013173 -1.285222 0.078169
H  -4.688575 -2.140219 1.506784
H  -3.252311 -1.192251 2.007239
H  -3.063102 -2.582771 0.892558
