program: Gaussian 09
title: 000239511
version: EM64L-G09RevD.01
frameworkgroup: C1[X(C5H5NO2S)]
method: RPBEPBE
basis: SDD
operation: Freq
keyword: #p
keyword: freq=noraman
keyword: PBEPBE/SDD
title: #p freq=noraman PBEPBE/SDD
converged: NO NO NO NO
title: Mulliken charges:
elementType: S O O N C C C C C H H H H H
charge: 0.333371 -0.329268 -0.376161 -0.316204 -0.240203 -0.241618 -0.123453 0.308596 -0.508569 0.252455 0.251305 0.271155 0.335305 0.383286
chargesum: 0.00000
title: Mulliken charges with hydrogens summed into heavy atoms:
elementType: S O O N C C C C C
charge: 0.333371 -0.329268 0.007126 0.019101 -0.240203 0.010838 0.127852 0.308596 -0.237413
polarizability: 1.32367354e+02 -9.51353989e-01 9.03418246e+01 6.97095605e-01 4.52549834e-01 3.32299066e+01
1716.lowfreq: -11.4835 -0.0021 -0.0009 0.0016 2.0973 7.9115 43.5204 117.3523 130.8028
frequency: 43.3240 117.3515 130.7962 213.3932 276.4001 319.3133 347.4326 424.0745 462.5769 518.9292 561.4443 631.9154 689.2777 698.3820 712.1812 801.7932 830.0846 837.6852 911.9858 954.4606 1045.7052 1080.1873 1109.8820 1217.8975 1247.4820 1331.5050 1358.7348 1458.9724 1470.7100 1512.8138 1584.4131 3165.3359 3181.2558 3189.4572 3239.9189 3604.9180
redmass: 6.4666 6.1547 6.5272 6.2864 6.5782 2.1122 2.8915 4.0374 5.9757 1.2094 2.8854 9.2537 5.2480 6.3979 1.1672 5.8074 1.3331 5.7306 1.3750 6.3663 1.8968 1.5725 1.7168 1.5558 1.4448 2.2083 2.7082 7.1023 2.4029 3.0164 4.2646 1.0918 1.0631 1.0962 1.1001 1.0820
irintensity: 4.5134 0.9729 0.4117 31.8698 33.1071 70.7522 35.0004 35.5212 17.4517 125.4995 0.5699 1.4477 26.0179 3.6920 127.7510 41.3458 11.1570 1.0685 0.4549 93.1000 33.5631 5.9691 6.7404 17.7630 4.3277 44.3036 183.5718 57.0508 113.4883 15.5528 48.6872 4.1682 31.2683 4.2823 0.6222 60.3282
temp: 298.150 k
press: 1.00000 atm
elementType: 16 8 8 7 6 6 6 6 6 1 1 1 1 1
symmnumber: 1
zpe: 246921.1 jmol-1
zpe.correction: 0.094047 hartree
zpe.thermalcorrener: 0.102735 hartree
zpe.thermalcorrenthalpy: 0.103679 hartree
zpe.thermalcorrgfe: 0.059605 hartree
zpe.sumelectzpe: -796.067679 hartree
zpe.sumelectthermal: -796.058991 hartree
zpe.sumelectthermalent: -796.058047 hartree
zpe.sumelectthermalfe: -796.102121 hartree
dipole: -2.8640 3.2825 -0.8524
dipole: 4.4389
quadrupole: -56.7563 -56.5207 -62.3399
quadrupole: 0.5650 -0.9888 0.0878
quadrupole: 1.7826 2.0183 -3.8009 0.5650 -0.9888 0.0878
hfenergy: -796.1617262 hartree
pointgroup: C01 [X(C5H5N1O2S1)]
dipole: 1.2448769 1.1374627 0.4542841 debye
dipolederiv: 0.1432798 -0.0831629 0.0022601 -0.0117415 -0.1896359 0.0172659 -0.0159044 0.0155778 0.18019 -0.7276084 -0.2534868 -0.0650974 -0.0661466 -0.8353249 -0.1200773 0.0053311 -0.1217986 -0.3998126 -0.8817303 0.2209272 -0.0069449 -0.0845743 -0.1391116 0.0233536 -0.0130033 0.0204954 -0.3568536 0.1424516 0.0385424 0.0567854 0.5086156 -0.6425638 0.048842 -0.0158184 0.1281917 -0.2787006 -0.4898376 -0.1924573 -0.0232787 -0.3807603 0.2938399 -0.0871265 -0.0076488 -0.0731138 -0.1642998 0.134037 -0.1093514 0.0425976 0.0738002 -0.1513222 -0.0052219 0.0645006 -0.0284091 -0.1336035 -0.1353324 0.1375085 -0.0048596 0.1926409 -0.1731641 0.015896 -0.0377002 0.0137441 -0.1457397 1.2203149 -0.0268146 0.040459 -0.0544967 1.0779957 0.2163674 -0.0135254 0.1871771 0.282479 -0.1297879 0.2091766 0.0089942 -0.0163652 0.2429251 -0.0331128 0.0125483 -0.008269 -0.305555 0.0827152 0.0688497 -0.0160678 0.0768463 -0.0206475 0.0280996 -0.0133783 0.0214442 0.1904656 0.022375 -0.0711474 -0.0115393 -0.1108913 0.0135896 0.0051164 -0.0108154 0.008418 0.1971997 0.0122046 0.0290736 -0.0205394 0.0092773 0.0849445 0.0101497 -0.0044932 0.0091765 0.217671 0.1442417 -0.0240581 -0.0218004 -0.1202573 0.2712174 -0.0718733 0.0130227 -0.115036 0.3414999 0.4626768 0.0564004 0.0190312 -0.0159471 0.1672577 -0.0476787 0.0368848 -0.0575982 0.3750597 unknown
polarizability: 131.5875346|-4.0704792|90.6570226|6.4846974|1.3497193|33.6945275 unknown
InChI: InChI=1S/C5H5NO2S/c7-5(6-8)4-2-1-3-9-4/h1-3,6,8H
charge 0 multiplicity 1
14 atoms
S  1.333907 -1.408803 0.067149
O  -1.72481 -1.254986 -0.517734
O  -3.379274 0.745764 -0.129604
N  -1.960811 0.969884 -0.051185
C  0.296313 0.056587 -0.112931
C  1.062099 1.221553 -0.125261
C  2.472017 0.98146 0.022582
C  -1.153534 -0.13993 -0.232371
C  2.783909 -0.366222 0.142428
H  0.641196 2.220402 -0.270566
H  3.223054 1.774326 0.03069
H  3.760902 -0.831478 0.260152
H  -1.740948 1.841645 0.428087
H  -3.39932 -0.243702 -0.366735
