program: Gaussian 09
title: 000239504
version: EM64L-G09RevD.01
frameworkgroup: C1[X(C6H12O6P2)]
method: RPBEPBE
basis: SDD
operation: Freq
keyword: #p
keyword: freq=noraman
keyword: PBEPBE/SDD
title: #p freq=noraman PBEPBE/SDD
converged: YES YES NO NO
title: Mulliken charges:
elementType: P P O O O O O O C C C C C C H H H H H H H H H H H H
charge: 1.049530 1.049502 -0.512610 -0.523806 -0.512607 -0.523788 -0.520367 -0.520365 -0.334909 -0.271267 -0.334913 -0.271270 -0.282344 -0.282332 0.247751 0.238600 0.226705 0.227510 0.247752 0.238597 0.226699 0.227514 0.240843 0.214357 0.240832 0.214386
chargesum: 0.00000
title: Mulliken charges with hydrogens summed into heavy atoms:
elementType: P P O O O O O O C C C C C C
charge: 1.049530 1.049502 -0.512610 -0.523806 -0.512607 -0.523788 -0.520367 -0.520365 0.151442 0.182948 0.151436 0.182943 0.172856 0.172886
polarizability: 1.77861704e+02 -1.55448818e+01 1.10369134e+02 -1.29084032e-03 1.03883665e-03 1.00786281e+02
1716.lowfreq: -4.6378 0.0015 0.0023 0.0025 2.3781 3.3118 11.8812 18.8705 32.1026
frequency: 11.7417 18.2056 32.1013 35.2856 61.6870 91.4412 104.1928 151.5507 158.6647 204.2486 230.2490 240.5131 247.3631 298.0112 298.2040 335.5102 442.6474 531.4713 545.4427 552.5951 553.6345 589.3039 592.2679 592.4996 640.3602 665.1412 666.8412 810.9907 827.1979 827.2250 862.5894 864.8817 945.2050 945.3436 963.0107 967.5828 984.1517 985.3568 1058.4361 1093.9476 1094.0188 1115.9462 1158.6207 1158.6361 1189.9978 1190.0849 1199.7406 1275.9351 1313.5379 1313.5462 1319.1722 1323.5555 1323.6000 1373.2418 1459.5821 1459.6282 1463.5479 1469.5327 1469.6368 1477.1116 2976.5653 2977.6976 3016.2727 3016.4439 3029.3353 3029.4029 3075.7425 3092.9059 3092.9316 3096.1910 3120.4918 3120.5552
redmass: 6.2079 5.5549 5.7611 6.1534 3.7070 3.3102 4.6302 2.6402 2.3029 3.7306 4.7232 4.6778 3.5467 6.6955 7.6162 6.2732 8.5305 12.3028 10.4014 7.0858 6.9655 11.3602 3.4402 3.4628 8.0525 12.3107 12.1707 1.1371 2.1238 2.1219 4.4990 4.3920 2.9249 2.9047 7.3309 7.5373 4.3320 4.7535 4.2641 1.5461 1.5461 1.6556 1.1257 1.1258 1.2217 1.2218 1.1383 1.1160 1.2257 1.2258 1.1782 1.1908 1.1911 1.2562 1.0907 1.0907 1.0736 1.0914 1.0911 1.0846 1.0649 1.0669 1.0596 1.0596 1.0614 1.0615 1.0951 1.1054 1.1053 1.1035 1.1082 1.1082
irintensity: 0.4862 1.3933 0.0011 0.7875 0.1924 9.0760 13.0533 0.4106 1.5693 0.4568 0.5159 0.2866 1.4705 9.3183 26.5268 15.2037 26.2248 59.8389 6.7904 15.0917 73.0749 231.9571 21.1607 41.7070 73.8395 105.6906 13.0550 0.0240 1.8309 0.9558 242.2159 11.4745 8.5015 3.7720 11.4988 522.9112 12.6249 39.2823 0.5952 7.7033 0.0678 8.3572 2.7469 4.2372 1.2029 11.6213 1.1971 1.8258 10.0955 6.8024 3.7592 5.1503 0.0745 3.0003 2.5205 12.5085 2.9648 2.7023 0.3289 9.8560 1.6278 85.3441 105.7329 11.6815 18.6809 43.2786 10.9351 18.5067 13.7917 27.9792 36.8751 12.1620
temp: 298.150 k
press: 1.00000 atm
elementType: 15 15 8 8 8 8 8 8 6 6 6 6 6 6 1 1 1 1 1 1 1 1 1 1 1 1
symmnumber: 1
zpe: 501356.7 jmol-1
zpe.correction: 0.190957 hartree
zpe.thermalcorrener: 0.207012 hartree
zpe.thermalcorrenthalpy: 0.207956 hartree
zpe.thermalcorrgfe: 0.142801 hartree
zpe.sumelectzpe: -1368.500233 hartree
zpe.sumelectthermal: -1368.484178 hartree
zpe.sumelectthermalent: -1368.483234 hartree
zpe.sumelectthermalfe: -1368.548389 hartree
dipole: 0.0006 0.0010 1.0675
dipole: 1.0675
quadrupole: -78.3845 -99.3256 -98.7997
quadrupole: -20.2291 0.0015 0.0014
quadrupole: 13.7855 -7.1557 -6.6298 -20.2291 0.0015 0.0014
hfenergy: -1368.6911894 hartree
pointgroup: C01 [X(C6H12O6P2)]
dipole: 0.0002201 -0.4200018 0.0009384 debye
dipolederiv: 1.7055289 -0.0960155 -0.2494344 -0.6053938 0.9995453 0.0308307 -0.3509532 0.0467637 0.9954473 1.7059583 0.0954715 -0.2495052 0.6045762 0.9993646 -0.030754 -0.3521893 -0.0468016 0.9952284 -0.8890642 -0.1099514 0.055007 -0.2945871 -0.5680119 0.011358 0.2840264 0.0951028 -0.5615019 -0.9239497 0.0292754 0.3318084 -0.092228 -0.4706867 0.1024658 0.4199937 -0.1613955 -0.764858 -0.8893656 0.1101148 0.0546332 0.2953125 -0.5682393 -0.0111787 0.2831259 -0.0949592 -0.5610662 -0.9244 -0.0285524 0.3318724 0.093399 -0.4705166 -0.1030972 0.4196935 0.1606637 -0.7645814 -1.6239523 0.1996268 0.012755 0.8378639 -0.6348472 -0.0581703 -0.2360392 0.063546 -0.4320376 -1.6239244 -0.1996206 0.0130255 -0.8386709 -0.6349627 0.0584434 -0.2341782 -0.0631086 -0.4319393 0.2485744 -0.035856 -0.0358511 0.05497 0.3331275 -0.0764579 -0.2983349 -0.176789 0.2785902 0.6609172 -0.0947482 -0.286052 0.0549128 0.2168856 -0.1424917 -0.0812589 -0.027149 0.1751605 0.2487633 0.035634 -0.0359692 -0.0557993 0.3337761 0.0762808 -0.298259 0.1766373 0.2777862 0.6611493 0.0940493 -0.2860732 -0.0551603 0.2173347 0.1423159 -0.0807614 0.0270879 0.1744923 1.0780251 -0.1929596 0.013749 0.0992659 0.2127182 -0.0179157 0.1089755 0.0362887 0.2005767 1.0781677 0.1930966 0.0134729 -0.0988814 0.2126582 0.0178754 0.1093212 -0.0362816 0.200573 0.0591929 0.1081806 -0.004575 0.0178633 -0.1003979 0.0336162 0.0456722 0.0405542 0.0178621 -0.1265551 -0.0589669 0.0004506 -0.0484565 0.0857724 0.0163695 0.0166267 0.0184031 0.0917321 -0.1481952 0.094472 0.0877033 0.0962979 -0.0521347 -0.0368119 0.0126072 -0.0057115 0.0575802 0.0355167 0.0226535 0.0196058 -0.0244227 0.0489263 0.1176466 0.0509996 0.0783204 -0.0928086 0.0591713 -0.1081529 -0.0042729 -0.0177109 -0.1005983 -0.0333256 0.0457467 -0.0403029 0.0180724 -0.126578 0.0589643 0.0001735 0.0485026 0.0856906 -0.0163297 0.0163667 -0.0183444 0.0918285 -0.1482437 -0.0942637 0.0878148 -0.0963062 -0.0520689 0.0370347 0.0126929 0.005915 0.0575464 0.0354603 -0.0225434 0.0197825 0.0246288 0.0484471 -0.117983 0.0510456 -0.0786887 -0.0922666 -0.0591936 0.0824937 0.036233 0.07316 -0.0276145 -0.087582 0.0132512 -0.0562934 0.0267907 -0.0169155 -0.014269 0.0186502 -0.1414298 -0.0432861 0.0963925 0.0143744 0.0529119 0.0074988 -0.0592084 -0.082427 0.0363839 -0.0731534 -0.0273142 0.0877012 0.013403 0.0564213 0.0264546 -0.0168799 0.0142942 0.0186122 0.1414473 -0.0435678 -0.0962331 0.0140519 -0.0527905 0.007839 unknown
polarizability: 178.8621558|-0.0125032|100.7862919|-13.1574788|0.0095374|109.3686719 unknown
InChI: InChI=1S/C6H12O6P2/c1-2-8-13(7-1)11-5-6-12-14-9-3-4-10-14/h1-6H2
charge 0 multiplicity 1
26 atoms
P  -2.636177 1.188566 -0.909531
P  2.635873 1.19106 0.90656
O  -4.190534 0.425227 -1.227694
O  -3.031788 1.415299 0.822077
O  4.190132 0.428734 1.227666
O  3.032529 1.413304 -0.825403
O  -1.694622 -0.321716 -0.809007
O  1.694546 -0.319583 0.809424
C  -4.678855 -0.217071 0.030606
C  -4.323034 0.758068 1.177221
C  4.6793 -0.216778 -0.028664
C  4.324146 0.755398 -1.177982
C  -0.222633 -0.22793 -0.737446
C  0.22256 -0.2262 0.737521
H  -4.171608 -1.19116 0.145271
H  -5.763617 -0.352409 -0.095866
H  -5.081408 1.554097 1.286631
H  -4.177348 0.235215 2.136635
H  4.172184 -1.191192 -0.141139
H  5.76399 -0.351721 0.098848
H  5.082469 1.551278 -1.288825
H  4.179226 0.230132 -2.136191
H  0.166125 -1.124463 -1.247463
H  0.157416 0.671757 -1.264917
H  -0.166091 -1.121629 1.249557
H  -0.15768 0.67462 1.262914
