program: Gaussian 09
title: 000239502
version: EM64L-G09RevD.01
frameworkgroup: C1[X(C8H9O3P)]
method: RPBEPBE
basis: SDD
operation: Freq
keyword: #pfreq=noraman
keyword: PBEPBE/SDD
title: #p freq=noraman PBEPBE/SDD
converged: YES YES NO NO
title: Mulliken charges:
elementType: P O O O C C C C C C C C H H H H H H H H H
charge: 1.053862 -0.513745 -0.507888 -0.547124 -0.268020 -0.341637 0.328233 -0.354090 -0.363486 -0.190402 -0.199716 -0.250410 0.235601 0.228003 0.242782 0.248698 0.253747 0.260618 0.228757 0.227114 0.229104
chargesum: 0.00000
title: Mulliken charges with hydrogens summed into heavy atoms:
elementType: P O O O C C C C C C C C
charge: 1.053862 -0.513745 -0.507888 -0.547124 0.195583 0.149844 0.328233 -0.100344 -0.102868 0.038355 0.027398 -0.021306
polarizability: 1.75263554e+02 -1.08047611e+00 1.07201537e+02 -1.73698596e+00 -4.20502056e+00 7.01217259e+01
1716.lowfreq: -14.2998 -0.0018 -0.0017 -0.0017 5.2601 8.0393 29.6945 45.1447 75.3630
frequency: 29.2139 45.0833 75.3343 108.0160 170.1563 219.3810 245.2000 273.0944 399.1201 411.9396 477.5055 515.7192 552.9721 562.9377 593.5156 601.8415 627.5441 659.5485 693.7969 762.9622 811.7006 826.1953 834.3517 864.6214 905.4051 943.3695 965.7017 983.9807 985.2471 986.7277 1020.1651 1075.3828 1092.6465 1159.5199 1165.5084 1173.0921 1190.7930 1195.1394 1307.5264 1315.1384 1326.1269 1379.4927 1439.6276 1458.4766 1466.5519 1470.6145 1590.4217 1602.6782 3021.9224 3026.9044 3101.3347 3121.3975 3127.5149 3135.4478 3147.4866 3161.6923 3173.5964
redmass: 4.8613 4.6872 4.2849 5.0575 2.5779 7.8908 5.7735 4.3802 8.5645 2.9351 4.9732 5.1348 7.7468 6.5922 3.8714 6.6412 8.5695 11.8051 2.1857 1.5988 6.4943 2.1804 1.2579 4.4656 1.4257 2.8599 1.3747 4.1117 3.7232 1.4893 2.1010 1.5251 1.5522 1.1201 1.2092 1.1750 1.4820 1.8248 1.3377 1.2266 1.1915 8.1721 2.2943 1.0913 1.0928 2.2525 6.4554 6.2971 1.0600 1.0619 1.1049 1.1079 1.0851 1.0885 1.0941 1.0966 1.0999
irintensity: 0.8414 1.6244 2.2577 5.5428 2.0619 2.3419 3.8084 7.3832 35.1249 0.3686 36.6432 18.0763 4.8753 36.1356 37.6237 46.3133 96.2065 65.5525 31.4749 89.5392 155.0948 2.3000 3.6108 97.8171 8.3122 8.0310 0.1127 62.2496 15.0917 0.3476 14.0612 12.4153 3.1994 7.8848 40.9584 38.7118 82.7137 77.6419 0.5868 9.4873 1.6580 0.7071 5.2968 5.8587 1.5913 119.4415 15.5694 68.4652 61.1976 28.3001 13.0596 23.7553 3.6794 7.1318 21.2279 23.9992 10.2331
temp: 298.150 k
press: 1.00000 atm
elementType: 15 8 8 8 6 6 6 6 6 6 6 6 1 1 1 1 1 1 1 1 1
symmnumber: 1
zpe: 410189.8 jmol-1
zpe.correction: 0.156233 hartree
zpe.thermalcorrener: 0.167398 hartree
zpe.thermalcorrenthalpy: 0.168342 hartree
zpe.thermalcorrgfe: 0.117451 hartree
zpe.sumelectzpe: -876.261207 hartree
zpe.sumelectthermal: -876.250042 hartree
zpe.sumelectthermalent: -876.249098 hartree
zpe.sumelectthermalfe: -876.299989 hartree
dipole: -0.7769 0.9449 1.2808
dipole: 1.7711
quadrupole: -61.7718 -77.6603 -77.4362
quadrupole: -2.8096 -6.0400 -0.3747
quadrupole: 10.5176 -5.3709 -5.1467 -2.8096 -6.0400 -0.3747
hfenergy: -876.4174403 hartree
pointgroup: C01 [X(C8H9O3P1)]
dipole: -0.3313035 -0.411328 -0.4545183 debye
dipolederiv: 2.1487399 0.1767498 -0.0717856 0.4885023 0.8551128 0.0737841 -0.2770019 0.0686684 1.0344459 -1.1726216 0.0544933 -0.0556678 -0.0243579 -0.4386586 -0.1144311 -0.438441 -0.0202492 -0.5114589 -0.8941264 -0.1419295 -0.130646 -0.1771578 -0.5471622 -0.0256697 -0.335054 -0.2541979 -0.6664701 -2.1444304 -0.0889784 0.2782976 -0.2042019 -0.3880243 0.0025247 0.7383505 0.1225983 -0.500766 0.6007951 0.0843629 0.0252805 0.4190092 0.1726951 0.0336473 0.2047812 -0.043171 0.2871578 0.3932308 0.0765013 0.0528042 -0.0905607 0.0841274 -0.1372744 0.1354753 0.0583761 0.4126754 1.7493154 0.0257392 -0.2549927 -0.3194032 0.1269312 0.0743668 -0.0244804 0.015015 0.0207966 -0.4184159 -0.0274886 0.0587923 -0.1233996 0.0244942 -0.0251512 0.0934544 -0.047851 -0.1694589 -0.288867 0.0024991 0.0337768 0.2892076 -0.0901817 -0.0513547 -0.0287411 -0.0052325 -0.1730724 0.123321 0.0144465 -0.0336412 0.0201797 0.1046473 -0.0552918 -0.0567103 -0.0567685 -0.1182328 0.0792182 0.0168448 -0.0261095 -0.0754698 0.1381017 -0.0458209 -0.0175512 -0.058238 -0.1219239 -0.0122757 -0.0577073 -0.0094195 -0.0105766 -0.1584539 -0.0089894 -0.0205305 -0.0016309 -0.1855623 -0.0070566 0.013801 -0.0554575 0.0226174 0.0460841 0.0838794 -0.1267859 0.0820284 -0.0261952 -0.151301 -0.0410287 0.0520933 -0.1387156 0.0375426 0.0080048 0.0881175 0.0134467 -0.0081821 0.009753 -0.0986853 -0.0571198 -0.0987408 -0.0099519 -0.0454444 -0.0578863 -0.0431588 0.0624126 -0.0148042 -0.0002561 0.0922739 0.0234954 0.064764 0.0765348 0.0216565 0.0008037 -0.0893543 0.088424 0.0700141 -0.0065649 0.0645484 -0.0290435 0.0293584 0.0060988 0.0302016 0.1584468 0.0190301 -0.0808136 0.0328898 -0.0921099 0.0364089 0.024995 0.0198453 0.0290539 0.1474359 -0.0212989 -0.0985197 0.0445447 -0.105672 -0.0252592 0.0525045 0.0446057 0.0545556 0.1384784 0.0434033 0.0590041 0.0014369 0.0885651 -0.0882759 0.0377414 -0.0004507 0.0405937 0.1469898 -0.1300331 0.0409512 0.0292143 0.0442407 0.0841017 0.0120865 0.0312479 0.0151564 0.1618377 unknown
polarizability: 174.0700888|4.8125968|107.1949645|-9.1942335|-6.2021209|71.3217638 unknown
InChI: InChI=1S/C8H9O3P/c1-2-4-8(5-3-1)11-12-9-6-7-10-12/h1-5H,6-7H2
charge 0 multiplicity 1
21 atoms
P  -1.494375 -0.066467 1.462278
O  -2.929107 0.828087 0.966707
O  -2.091839 -1.568929 0.716679
O  -0.473073 0.601015 0.12762
C  -3.81909 0.011775 0.084719
C  -2.996634 -1.197584 -0.413199
C  0.904281 0.282016 0.060652
C  1.794737 1.328584 -0.274322
C  1.378646 -1.037193 0.268022
C  3.173198 1.05068 -0.397322
C  2.763964 -1.296165 0.156492
C  3.66484 -0.258756 -0.17631
H  -4.143759 0.667577 -0.738794
H  -4.684905 -0.30264 0.694011
H  -3.615532 -2.083754 -0.6193
H  -2.378982 -0.93599 -1.29077
H  1.394978 2.335118 -0.430922
H  0.673025 -1.848056 0.483538
H  3.864372 1.859514 -0.659525
H  3.135165 -2.314304 0.31889
H  4.735992 -0.467626 -0.267743
