program: Gaussian 09
title: 000019662
version: EM64L-G09RevD.01
frameworkgroup: C1[X(C9H6ClNO3S)]
method: RPBEPBE
basis: SDD
operation: Freq
keyword: #p
keyword: freq=noraman
keyword: PBEPBE/SDD
title: #p freq=noraman PBEPBE/SDD
converged: YES YES NO NO
title: Mulliken charges:
elementType: Cl S O O O N C C C C C C C C C H H H H H H
charge: -0.040314 0.255495 -0.177197 -0.406429 -0.209777 -0.213702 0.792695 -0.422491 -0.498418 -0.087535 -0.242109 -0.257121 -0.219531 -0.235098 0.221531 0.302408 0.295871 0.253417 0.258180 0.242427 0.387699
chargesum: 0.00000
title: Mulliken charges with hydrogens summed into heavy atoms:
elementType: Cl S O O O N C C C C C C C C C
charge: -0.040314 0.255495 -0.177197 -0.018730 -0.209777 -0.213702 0.792695 -0.422491 0.099861 -0.087535 -0.242109 -0.003704 0.038648 0.007329 0.221531
polarizability: 1.68449876e+02 5.34436870e+00 1.64852227e+02 -1.91560403e+01 -4.42140790e+00 7.24017334e+01
1716.lowfreq: -8.1768 -5.0504 -0.0025 -0.0020 0.0026 4.5218 35.7561 45.9332 59.0992
frequency: 35.7247 45.8806 59.0970 99.4575 107.7662 201.1008 203.8313 237.1504 275.8283 320.6039 353.9969 362.8565 384.0094 425.0497 474.2997 487.6340 500.2670 509.7770 537.4378 545.5847 601.4763 625.6817 659.8948 692.8786 718.4431 761.9147 768.5966 822.8283 862.7212 890.9986 962.8714 965.4234 1020.3596 1052.8754 1069.2495 1082.9476 1153.3038 1163.1651 1217.0227 1263.0926 1296.4126 1324.9786 1369.0277 1380.3817 1424.0572 1435.1141 1462.6402 1568.1077 1599.9675 1660.3901 1686.6789 3029.1980 3114.5192 3153.4385 3167.6195 3183.0503 3526.5552
redmass: 8.9970 7.6249 13.9530 13.6131 10.2577 17.5989 4.7367 7.6158 7.1791 3.9790 5.7278 7.8594 8.4348 11.5981 3.7978 2.8011 5.3167 6.5420 4.1539 4.6901 9.1754 1.4239 7.6328 7.1881 4.7045 9.1813 1.3669 5.1082 4.0040 1.3525 1.3432 3.3953 5.0788 2.5023 4.9634 1.9844 2.8963 1.2960 1.4179 1.5971 1.9861 2.8367 1.7124 4.1981 2.0061 1.4106 3.2280 7.0814 8.3790 11.5169 9.0695 1.0647 1.0961 1.0870 1.0929 1.0998 1.0643
irintensity: 2.8957 0.3737 0.7354 0.5591 0.3244 0.8833 0.0127 2.6692 0.6558 0.9595 3.8108 3.0345 13.7152 8.1031 21.2143 10.2010 0.0237 16.9084 0.9302 59.3163 6.6845 120.6356 6.5182 18.6192 29.8586 34.9786 57.8895 5.2657 8.0562 0.0596 1.2010 29.7449 60.8781 332.5372 19.3010 17.5090 60.8887 13.5704 0.0325 8.0555 43.7420 18.0684 29.3907 7.3542 24.8233 45.7645 146.7731 26.6290 7.2893 516.2191 166.8808 16.5000 2.3874 1.9947 2.8826 6.7290 38.6111
temp: 298.150 k
press: 1.00000 atm
elementType: 17 16 8 8 8 7 6 6 6 6 6 6 6 6 6 1 1 1 1 1 1
symmnumber: 1
zpe: 358312.9 jmol-1
zpe.correction: 0.136474 hartree
zpe.thermalcorrener: 0.149740 hartree
zpe.thermalcorrenthalpy: 0.150684 hartree
zpe.thermalcorrgfe: 0.094992 hartree
zpe.sumelectzpe: -1484.056244 hartree
zpe.sumelectthermal: -1484.042978 hartree
zpe.sumelectthermalent: -1484.042033 hartree
zpe.sumelectthermalfe: -1484.097726 hartree
dipole: -0.8072 -3.3568 -0.5325
dipole: 3.4933
quadrupole: -80.9287 -107.5509 -104.4775
quadrupole: 1.6779 -0.3742 -0.7078
quadrupole: 16.7237 -9.8986 -6.8251 1.6779 -0.3742 -0.7078
hfenergy: -1484.1927178 hartree
pointgroup: C01 [X(C9H6Cl1N1O3S1)]
dipole: -0.7750739 1.1132018 0.221243 debye
dipolederiv: -0.3471581 -0.2906041 -0.0862341 -0.2126531 -0.4929136 -0.105136 -0.0949059 -0.1268715 -0.0774056 -0.6187577 0.1260525 -0.1263238 -0.0232341 -0.134397 -0.0180085 -0.1654622 0.0266008 0.0326335 -1.2372837 0.5906009 -0.1660307 0.4467579 -0.8166338 0.0979711 -0.1925897 0.1043065 -0.3247917 -1.1252462 -0.3864894 -0.1970892 -0.4634958 -0.635146 -0.1527061 -0.0624028 -0.0723683 -0.2833152 -0.6115163 -0.1748758 -0.0389911 -0.1790006 -0.3647195 0.0388165 -0.1581436 -0.0803613 -0.8463616 -0.9156849 0.1180417 -0.0956883 0.2840658 -1.0289549 0.0464687 -0.143176 -0.0424327 -0.202515 0.6341469 -0.568869 0.0148409 -0.332592 -0.2845342 -0.0826333 0.0488072 -0.1838645 0.1407841 -0.0873893 -0.1656161 0.0163724 -0.4035523 0.5501993 -0.0282436 -0.0184554 0.0147892 -0.1110609 0.4597659 0.2054466 -0.0103794 0.1125805 0.0611193 0.0867735 0.1700013 0.1697619 -0.0568724 1.697038 -0.4280264 0.3195555 -0.3929376 1.4455306 -0.0405483 0.3120449 -0.0038965 0.2181151 0.4325796 0.4336959 0.1631241 0.417623 0.7145494 0.1664712 0.1738014 0.1908368 -0.0240029 0.0297312 0.0556787 0.035476 0.0993691 -0.0722698 0.0313419 0.0443124 0.0211062 -0.0915834 -0.1880793 -0.0226942 -0.022573 -0.0894454 -0.1093204 -0.0205717 -0.0262027 -0.0120921 -0.1159646 0.0144321 -0.0231805 0.0508086 0.0531948 -0.0059261 0.0234502 0.0534248 0.0074885 -0.1464666 1.2799729 0.582119 0.1569363 0.6771678 0.6207514 -0.0241493 0.0542224 -0.004683 1.0970183 0.047083 -0.0144071 0.0152513 0.1341611 0.1222915 0.0508685 0.0297978 0.0041173 0.1335496 0.0723643 -0.0432692 0.0597183 -0.0940952 0.0425108 -0.0759441 0.040902 -0.036677 0.0716319 0.0550211 -0.0484729 -0.0315948 -0.0873938 0.0145614 -0.0350523 -0.0373792 -0.0255339 0.1537041 0.1015557 0.0201409 -0.0143823 0.0372606 -0.0270242 -0.0103983 -0.0139534 -0.0130492 0.1613397 -0.0690846 0.042916 -0.0547523 0.0498479 0.0591685 0.0021586 -0.0556664 0.0008739 0.1542536 0.3765094 -0.0081874 0.0119554 -0.0336287 0.3411572 0.0490713 0.0410229 0.061949 0.1173101 unknown
polarizability: 171.021275|-3.2013217|161.580101|20.7605868|4.5211917|73.1024603 unknown
InChI: InChI=1S/C9H6ClNO3S/c10-5-2-1-3-6-8(5)11(4-7(12)13)9(14)15-6/h1-3,12H,4H2
charge 0 multiplicity 1
21 atoms
Cl 0.055773 2.735994 0.701433
S  -0.998112 -2.648799 -0.091183
O  1.694847 -2.676249 0.566151
O  3.57839 1.505811 -0.100448
O  2.053803 0.639537 -1.635538
N  0.595172 -0.57739 0.503743
C  -0.665205 0.008741 0.231368
C  -1.659539 -0.961709 -0.106373
C  1.85308 0.122813 0.788127
C  0.674432 -1.983373 0.380462
C  -1.075139 1.363604 0.263944
C  -2.985945 -0.617224 -0.410588
C  -2.400529 1.729511 -0.041376
C  -3.355284 0.744904 -0.378839
C  2.454952 0.760702 -0.463947
H  2.568044 -0.63342 1.160745
H  1.726726 0.887205 1.567976
H  -3.715683 -1.390376 -0.667381
H  -2.678933 2.786443 -0.011353
H  -4.380946 1.043515 -0.613985
H  3.990897 1.910062 -0.91074
