program: Gaussian 09
title: 000239474
version: EM64L-G09RevD.01
frameworkgroup: C1[X(C6H9N3S)]
method: RPBEPBE
basis: SDD
operation: Freq
keyword: #pfreq=noraman
keyword: PBEPBE/SDD
title: #p freq=noraman PBEPBE/SDD
converged: YES YES NO NO
title: Mulliken charges:
elementType: S N N N C C C C C C H H H H H H H H H
charge: 0.159885 -0.039175 -0.681607 0.020251 0.341355 0.143253 -0.359935 -0.794848 -0.417150 -0.808849 0.225242 0.272506 0.225221 0.330058 0.330609 0.242348 0.241070 0.285074 0.284691
chargesum: 0.00000
title: Mulliken charges with hydrogens summed into heavy atoms:
elementType: S N N N C C C C C C
charge: 0.159885 -0.039175 -0.020941 0.020251 0.341355 0.143253 -0.359935 -0.071878 -0.174802 0.001986
polarizability: 1.46382224e+02 8.38811659e-01 1.16435064e+02 -1.06425227e-02 1.20681770e-02 5.06476154e+01
1716.lowfreq: -9.3833 -5.1542 0.0021 0.0025 0.0028 3.8940 44.4246 80.9182 101.4389
frequency: 44.1359 80.9170 101.4360 161.8634 166.6630 215.6888 261.8386 291.2032 294.7315 344.4030 376.5723 388.8866 481.7207 521.0840 538.7681 574.5819 640.4709 665.9492 763.6318 797.1571 844.9550 892.6898 966.7648 983.8139 992.1499 1039.1546 1069.5780 1172.7734 1212.5279 1264.9897 1285.4097 1345.0107 1385.2169 1400.9771 1415.3635 1432.6458 1449.9011 1458.4607 1471.9442 1511.6806 1539.0979 1638.7048 2960.1631 3026.6725 3031.6689 3119.0604 3152.8586 3159.6659 3170.6483 3552.7807 3693.7605
redmass: 3.2215 2.3146 1.2996 1.0466 3.5642 5.2664 4.2887 3.6851 2.7657 1.0654 1.2557 9.5291 3.3501 6.0424 5.9244 4.9850 6.4316 7.5292 5.5274 6.6973 4.6394 1.4299 1.6388 1.1736 1.2584 1.5349 1.9163 5.4922 3.2802 2.8356 8.3233 1.1452 1.3292 1.6825 4.7478 1.0524 1.0596 1.1721 1.0459 7.2125 4.7444 1.1929 1.0399 1.0280 1.0974 1.0953 1.1044 1.1058 1.0920 1.0457 1.1034
irintensity: 12.1981 0.5796 2.1454 0.4210 6.0060 0.0012 0.1341 7.3328 1.4041 45.1358 226.1213 3.1404 1.5364 5.9185 1.2205 12.9613 13.9766 6.0916 0.0743 26.8389 1.9945 13.0820 8.7980 8.9222 4.6969 3.5642 100.2163 1.3016 0.4991 5.0817 0.3424 6.3496 29.6164 27.6309 158.0661 14.2402 22.2586 14.0899 18.0051 162.8764 22.4310 191.5253 24.7827 21.4070 23.7115 5.4310 7.6448 9.2257 16.2209 54.6901 30.9764
temp: 298.150 k
press: 1.00000 atm
elementType: 16 7 7 7 6 6 6 6 6 6 1 1 1 1 1 1 1 1 1
symmnumber: 1
zpe: 384915.2 jmol-1
zpe.correction: 0.146606 hartree
zpe.thermalcorrener: 0.157594 hartree
zpe.thermalcorrenthalpy: 0.158538 hartree
zpe.thermalcorrgfe: 0.109637 hartree
zpe.sumelectzpe: -795.604170 hartree
zpe.sumelectthermal: -795.593183 hartree
zpe.sumelectthermalent: -795.592239 hartree
zpe.sumelectthermalfe: -795.641140 hartree
dipole: -0.2785 -3.1858 0.0134
dipole: 3.1980
quadrupole: -60.2009 -62.4624 -69.7418
quadrupole: -8.9040 -0.0142 -0.0240
quadrupole: 3.9341 1.6726 -5.6068 -8.9040 -0.0142 -0.0240
hfenergy: -795.7507767 hartree
pointgroup: C01 [X(C6H9N3S1)]
dipole: 0.0471076 -1.2572891 -0.0039437 debye
dipolederiv: -0.7252381 0.1394519 -0.0007491 0.3424158 -0.1740006 0.0002659 -0.0021632 0.0001796 -0.133471 -0.4281083 -0.0114496 -0.0001656 0.2917133 -0.3805367 0.0005582 -0.0002359 0.000365 -0.2133899 -0.1191912 -0.1048679 -0.0006074 -0.1590024 -1.3078481 0.0010704 -0.0002719 0.0029946 -0.6869604 -0.4977376 0.0293476 -0.0003969 0.258152 -0.5570243 0.0007448 -0.0011893 0.0008704 -0.1464824 -0.9076572 0.1800636 -0.0009986 0.3004835 1.180136 -0.0002384 -0.0008004 -0.0004627 0.1861721 0.7656063 0.3768148 0.0006049 -0.34979 0.0612886 -0.0006536 0.0008244 -0.0004453 -0.0236194 1.209052 -0.6724611 0.0024469 -0.4959272 0.1731228 -0.0007909 0.0023353 -0.0006856 -0.0454311 -0.1836756 -0.1080306 -0.0002123 -0.1115234 -0.0277154 -0.000035 -0.0003141 -0.0000437 0.0832949 0.1929163 -0.0047614 0.0001973 -0.0957445 0.4351311 -0.0008073 0.0003436 -0.0007019 -0.0793923 0.2183311 0.0900394 -0.0005622 0.1040873 0.0794511 -0.0007021 0.0000434 -0.0010312 0.0598714 0.0328245 -0.0063116 -0.0121199 -0.0794943 0.0192793 0.1201133 0.0555047 0.1037212 -0.0482149 0.0174265 0.0471621 -0.0001202 0.1487971 0.0229985 0.0002299 -0.0002021 0.0001324 0.123972 0.0329819 -0.0060482 0.0123135 -0.0794197 0.0189887 -0.1204054 -0.0552131 -0.1038013 -0.0480499 0.1676892 0.0225392 0.000263 0.0305812 0.2590365 -0.0001276 0.0007595 -0.0015633 0.3718529 0.1418473 0.0132566 0.0000596 0.0078736 0.2304632 -0.0002583 -0.0003428 -0.0005508 0.3572278 0.0594743 -0.0193401 -0.0000534 0.0023616 -0.0979171 0.0002862 0. 0.000204 0.1442231 -0.101493 0.0554726 -0.0007141 0.082281 0.0507162 0.0007866 -0.0005548 0.000652 0.1284041 0.0630071 -0.0102081 0.0257263 -0.0985804 0.0066134 -0.0901401 0.0164348 -0.0647956 -0.0138637 0.0619445 -0.0106692 -0.0249119 -0.0992646 0.0078169 0.0901035 -0.0149584 0.0649622 -0.0161432 unknown
polarizability: 146.2247835|-2.3219241|116.5923404|0.0822535|-0.0816361|50.647779 unknown
InChI: InChI=1S/C6H9N3S/c1-4-5(7)6(10-2)9-3-8-4/h3H,7H2,1-2H3
charge 0 multiplicity 1
19 atoms
S  2.300808 -1.12557 0.005856
N  -1.542086 1.417257 -0.001988
N  -0.582604 -2.1738 0.00171
N  0.873196 1.236326 0.00082
C  -0.489853 -0.788562 0.000932
C  -1.649158 0.051024 -0.000986
C  0.773252 -0.111184 0.0024
C  -3.036549 -0.547809 -0.001938
C  -0.291767 1.949312 -0.001391
C  3.600915 0.229181 0.001565
H  -3.213024 -1.177264 0.893377
H  -3.776348 0.266412 -0.003258
H  -3.211049 -1.178484 -0.896803
H  0.253802 -2.752895 -0.001461
H  -1.488237 -2.633031 0.001324
H  -0.2061 3.038988 -0.002646
H  4.569782 -0.293693 0.00662
H  3.47964 0.854645 0.896297
H  3.484184 0.845347 -0.90023
