program: Gaussian 09
title: 000019741
version: EM64L-G09RevD.01
frameworkgroup: C1[X(C15H17N3O4S)]
method: RPBEPBE
basis: SDD
operation: Freq
keyword: #p
keyword: freq=noraman
keyword: PBEPBE/SDD
title: #p freq=noraman PBEPBE/SDD
converged: YES YES NO NO
title: Mulliken charges:
elementType: S O O O O N N N C C C C C C C C C C C C C C C H H H H H H H H H H H H H H H H H
charge: 0.226772 -0.171206 -0.392039 -0.217991 -0.264265 -0.110126 -0.367117 -0.001452 -0.449401 -0.170591 -0.078947 -0.161325 0.080653 -0.654272 -0.688180 0.157015 0.261894 -0.677113 0.440042 -0.302845 -0.488374 -0.177835 -0.333332 0.309677 0.292530 0.312029 0.247223 0.243823 0.228408 0.230521 0.238958 0.249926 0.318836 0.386601 0.265464 0.212025 0.282415 0.243627 0.233718 0.244253
chargesum: 0.00000
title: Mulliken charges with hydrogens summed into heavy atoms:
elementType: S O O O O N N N C C C C C C C C C C C C C C C
charge: 0.226772 -0.171206 -0.005438 -0.217991 -0.264265 -0.110126 -0.048281 -0.001452 -0.139724 -0.170591 0.213583 0.150704 0.080653 0.065181 0.031226 0.157015 0.261894 -0.199625 0.440042 -0.020430 -0.244747 0.055884 -0.089079
polarizability: 2.46717665e+02 1.18821857e+01 1.90256557e+02 2.44744238e+00 6.78630310e+00 1.86313870e+02
1716.lowfreq: -12.3382 -4.3760 -1.5879 0.0012 0.0016 0.0024 8.9522 17.3834 26.2253
frequency: 6.0698 17.3647 26.1638 39.6077 41.3602 51.3329 62.6326 98.8031 106.4811 128.3358 141.4071 177.0584 204.7438 222.7526 248.0170 251.8765 254.1291 286.7451 288.5110 295.1149 298.2466 340.1883 367.4280 391.9125 395.7001 409.4263 445.4582 458.6948 470.9548 519.2662 528.6645 546.5916 561.7247 583.5573 600.7638 625.2150 629.8794 686.6462 697.0203 717.4658 725.6052 739.8445 773.4858 795.4203 822.2643 830.1413 842.6570 884.9133 913.6559 928.3677 933.5786 938.4154 945.4656 954.6335 983.7379 992.8076 997.2899 1006.0763 1007.7398 1028.6651 1055.7593 1086.7741 1099.9555 1117.1812 1128.5483 1142.1845 1148.5799 1183.8864 1190.6769 1195.9847 1204.3196 1221.9976 1225.9797 1258.5181 1270.5487 1281.5727 1286.6844 1312.1785 1318.4469 1323.0013 1341.5127 1346.1056 1384.7885 1401.5357 1416.9961 1453.3043 1458.8007 1460.4289 1464.6316 1478.8976 1480.2542 1480.5873 1556.5801 1583.6708 1618.9358 1646.2949 1728.3847 2981.2250 2986.4130 3003.3570 3015.9198 3058.6031 3064.8522 3075.3287 3081.2853 3083.8569 3095.6237 3104.4038 3104.4484 3132.5018 3145.4289 3167.6498 3507.2472 3549.0925
redmass: 5.6487 7.0801 5.4607 7.0249 6.7784 6.1091 7.2140 8.2217 6.4437 6.4471 6.4178 5.4851 3.5676 3.3942 1.7818 2.3358 2.3822 4.0772 5.5966 1.1631 3.5906 3.6223 4.2382 4.4156 3.0621 4.2076 3.9693 3.5677 5.0076 3.4016 5.9643 4.7916 3.4129 1.3063 4.1510 1.9456 3.3381 4.6477 4.3432 4.2878 3.0562 3.9549 5.8695 2.3292 5.3434 4.2792 2.8312 4.8035 1.5501 2.1548 2.4731 2.0362 1.8302 1.6646 4.5852 3.1838 1.4721 3.6968 1.3648 3.0576 2.9302 2.1387 1.7299 1.7285 1.7799 1.3509 1.4668 2.1893 1.5912 1.9958 1.5731 1.8391 1.8458 1.7196 1.7065 4.1917 1.7476 4.3735 2.3768 1.8598 1.2673 1.2604 1.1933 1.1945 2.0725 1.2856 1.8307 1.0476 1.0484 1.0662 1.0589 1.6518 5.6477 5.7139 6.3479 8.7927 12.6935 1.0376 1.0360 1.0595 1.0840 1.0842 1.1025 1.0973 1.0898 1.0991 1.1009 1.0937 1.0975 1.0882 1.0924 1.1002 1.0640 1.0781
irintensity: 0.5965 1.0742 0.6284 4.6833 2.4631 0.7459 1.7558 3.6697 6.7251 1.2145 8.4724 0.1513 6.9178 0.2548 2.7927 0.1442 0.2446 1.8937 0.6249 0.1883 4.0520 2.1777 0.4895 4.8963 4.2819 5.8880 16.5095 0.4821 3.6959 45.3952 15.2601 15.9721 59.0942 65.2490 15.3267 61.8612 14.2387 8.9284 40.8246 12.2515 26.4697 14.7534 9.5983 23.6987 12.9251 8.8393 9.9765 21.5886 0.7716 0.7073 3.8652 5.3754 1.3826 2.3389 2.1480 11.3601 1.0218 11.5321 11.2788 0.7523 100.2510 164.0206 26.3286 13.8764 50.0374 23.0216 45.4612 8.4231 8.3811 20.3013 25.1763 13.5146 4.1166 73.2431 8.2380 118.9956 51.8322 4.2316 75.3147 11.9180 21.8620 16.4959 28.1284 20.1924 26.9958 39.7404 85.9031 1.0639 7.5663 0.5815 20.9155 276.5422 2.8842 2.3925 149.4551 226.8660 434.5783 17.5914 15.1388 17.9618 4.7639 27.7222 6.8811 13.4681 18.2470 11.2866 13.5415 9.8677 35.8739 6.4255 10.6640 19.9572 34.5885 20.9777
temp: 298.150 k
press: 1.00000 atm
elementType: 16 8 8 8 8 7 7 7 6 6 6 6 6 6 6 6 6 6 6 6 6 6 6 1 1 1 1 1 1 1 1 1 1 1 1 1 1 1 1 1
symmnumber: 1
zpe: 800180.9 jmol-1
zpe.correction: 0.304773 hartree
zpe.thermalcorrener: 0.327069 hartree
zpe.thermalcorrenthalpy: 0.328013 hartree
zpe.thermalcorrgfe: 0.248712 hartree
zpe.sumelectzpe: -1443.309109 hartree
zpe.sumelectthermal: -1443.286813 hartree
zpe.sumelectthermalent: -1443.285868 hartree
zpe.sumelectthermalfe: -1443.365169 hartree
dipole: 0.6932 -2.4627 1.6999
dipole: 3.0717
quadrupole: -149.0996 -145.1639 -145.4222
quadrupole: -11.9075 8.2991 5.8418
quadrupole: -2.5377 1.3980 1.1397 -11.9075 8.2991 5.8418
hfenergy: -1443.6138815 hartree
pointgroup: C01[X(C15H17N3O4S1)]
dipole: -0.2340853 1.1734762 -0.1690998 debye
polarizability: 247.6726286|5.3345595|181.3482294|-8.1257245|-2.1027388|194.2672352 unknown
InChI: InChI=1S/C15H17N3O4S/c1-15(2)11(14(21)22)18-12(20)10(13(18)23-15)17-9(19)6-8-4-3-5-16-7-8/h3-5,7,10-11,13,17,21H,6H2,1-2H3
charge 0 multiplicity 1
40 atoms
S  -1.909573 -0.160454 -2.210159
O  -2.019249 -2.393902 1.738676
O  -3.560927 1.588761 1.847449
O  -5.613869 0.893904 1.011188
O  2.132792 -2.239886 -0.991874
N  -2.192069 -0.344008 0.440271
N  0.936314 -1.189992 0.704344
N  5.334295 1.83158 0.909806
C  -1.083664 -0.049903 -0.506102
C  -3.531538 0.575292 -1.414445
C  -3.571564 -0.064086 0.047253
C  -0.338332 -1.331621 0.036449
C  -1.610407 -1.539143 0.934249
C  -3.402504 2.113892 -1.385006
C  -4.743662 0.120927 -2.244166
C  -4.364911 0.829214 1.002089
C  2.111524 -1.683088 0.145145
C  3.380805 -1.474025 0.983044
C  4.220669 -0.313566 0.456952
C  4.67073 -0.270329 -0.887921
C  4.583628 0.762081 1.306369
C  5.448788 0.826866 -1.315161
C  5.75601 1.851154 -0.388715
H  -0.57413 0.915274 -0.371696
H  -4.133083 -1.016916 -0.004675
H  -0.237425 -2.107793 -0.741672
H  -2.555803 2.448038 -0.760819
H  -3.245336 2.491022 -2.408959
H  -4.328841 2.574153 -0.990148
H  -4.717751 0.570134 -3.252223
H  -4.770622 -0.977198 -2.352144
H  -5.676045 0.44644 -1.746539
H  0.965432 -0.752656 1.62719
H  -4.141812 2.145937 2.435006
H  3.957339 -2.414452 0.914165
H  3.138817 -1.309384 2.049116
H  4.399156 -1.076607 -1.578063
H  4.265063 0.771169 2.357473
H  5.81209 0.891771 -2.345651
H  6.357165 2.7187 -0.683598
