program: Gaussian 09
title: 000239469
version: EM64L-G09RevD.01
frameworkgroup: C1[X(C7H8N2O2S2)]
method: RPBEPBE
basis: SDD
operation: Freq
keyword: #p
keyword: freq=noraman
keyword: PBEPBE/SDD
title: #p freq=noraman PBEPBE/SDD
converged: YES YES NO NO
title: Mulliken charges:
elementType: S S O O N N C C C C C C C H H H H H H H H
charge: 0.325741 0.307848 -0.441251 -0.239000 0.066757 0.045283 0.299619 -0.361000 -0.333925 -0.419974 0.125707 -0.831655 -0.825258 0.294743 0.248246 0.273974 0.274228 0.274967 0.275237 0.249712 0.390000
chargesum: 0.00000
title: Mulliken charges with hydrogens summed into heavy atoms:
elementType: S S O O N N C C C C C C C
charge: 0.325741 0.307848 -0.051251 -0.239000 0.066757 0.045283 0.299619 -0.361000 -0.039183 -0.419974 0.125707 -0.035207 -0.025342
polarizability: 2.10265451e+02 -2.35512785e+00 1.62461184e+02 3.08427051e-02 8.29856584e-02 5.75825736e+01
1716.lowfreq: -5.6849 -5.3426 0.0022 0.0027 0.0028 2.3236 45.3718 57.5201 91.0282
frequency: 45.3372 57.5158 91.0188 106.1654 115.2740 121.2157 131.5420 159.1617 174.8422 204.6538 258.3346 280.4524 315.5983 354.4987 395.3087 424.2536 510.7421 531.3960 568.0706 611.6420 638.3399 654.9278 666.5292 678.5888 713.2438 783.3836 806.1710 964.7832 968.3493 973.5591 979.1207 982.7962 992.8740 1075.8400 1160.4738 1184.9147 1247.3687 1269.2047 1331.5050 1334.5269 1348.3129 1376.7479 1431.8483 1437.7430 1438.9158 1447.5166 1456.7308 1523.4088 1628.8631 3024.3531 3025.1025 3148.3825 3149.8340 3155.1343 3157.5589 3176.0520 3535.4879
redmass: 4.5225 6.2096 2.2018 1.4747 3.8768 3.9379 1.2168 7.5750 4.7927 3.4585 8.0793 5.8597 10.4955 7.5525 11.2404 3.4907 9.0054 6.6023 1.3982 4.3720 6.8817 6.7925 6.4170 8.5333 10.1944 7.7234 10.6967 1.4560 1.1881 4.7226 1.1806 1.4407 1.2885 3.2540 5.4121 2.3863 5.7307 10.0688 1.7343 1.2926 1.1655 2.9331 1.0537 1.0529 1.0549 2.6902 1.4712 5.7289 8.7102 1.0281 1.0281 1.1041 1.1040 1.1057 1.1055 1.0933 1.0644
irintensity: 0.0019 4.3550 0.2990 0.0008 1.6908 0.9097 0.1456 5.1830 0.3592 1.4559 0.3257 10.8655 0.2574 0.9586 4.5958 10.7529 36.2635 30.8416 107.2686 47.0873 1.3424 4.4181 9.7080 25.1605 13.4203 8.3626 44.5029 6.4400 6.8922 173.8437 11.1965 20.5629 3.1701 368.1385 160.6458 25.3368 43.7196 18.4132 142.3035 9.0484 8.2720 214.2386 2.7716 29.1514 23.9408 234.4473 29.9946 425.8334 305.8411 4.6717 29.7449 14.2144 4.5762 12.9131 11.3625 0.6208 69.6609
temp: 298.150 k
press: 1.00000 atm
elementType: 16 16 8 8 7 7 6 6 6 6 6 6 6 1 1 1 1 1 1 1 1
symmnumber: 1
zpe: 378770.7 jmol-1
zpe.correction: 0.144266 hartree
zpe.thermalcorrener: 0.158321 hartree
zpe.thermalcorrenthalpy: 0.159265 hartree
zpe.thermalcorrgfe: 0.102295 hartree
zpe.sumelectzpe: -1326.652912 hartree
zpe.sumelectthermal: -1326.638857 hartree
zpe.sumelectthermalent: -1326.637912 hartree
zpe.sumelectthermalfe: -1326.694883 hartree
dipole: -1.1349 1.9445 -0.0022
dipole: 2.2514
quadrupole: -82.1279 -89.5131 -91.2505
quadrupole: -17.6420 -0.0823 -0.0632
quadrupole: 5.5026 -1.8826 -3.6200 -17.6420 -0.0823 -0.0632
hfenergy: -1326.7971777 hartree
pointgroup: C01 [X(C7H8N2O2S2)]
dipole: 0.4814826 -0.7391227 -0.0805098 debye
dipolederiv: 0.2448362 -0.3634521 -0.0449685 -0.1225121 -0.6258716 -0.0129043 -0.0339612 0.0130459 -0.0223847 -0.8530153 -0.0265009 0.0799726 -0.141314 0.1000292 0.0187329 0.0765348 0.0081169 -0.0489495 -0.8646834 0.5565676 0.0661756 0.8061595 -0.9786303 -0.1042029 0.0748446 -0.0773661 -0.4381746 -1.0509335 -0.1323044 0.0718306 -0.1887768 -0.7795965 0.0015319 0.0688788 -0.004039 -0.3183169 -1.220032 -0.7007773 0.0825519 -0.7353104 -0.9396716 0.0399746 0.0825449 0.0373139 -0.1147967 -1.4290171 -0.0613964 0.1208761 0.4807105 -0.5372447 -0.0620353 0.1415027 -0.0063208 -0.2185539 -1.1746321 0.1366298 0.1303828 -0.298421 -0.7931288 -0.0039763 0.1151714 -0.0483051 0.0377154 0.7084614 0.4857903 -0.0500531 0.1541579 1.4037216 0.0431783 -0.0642509 0.0087712 0.0058442 0.924797 0.2713706 -0.0816474 0.3710054 0.5198749 -0.0180277 -0.0788765 -0.008348 0.0214227 1.9921127 0.2194508 -0.1882886 0.1572213 0.6584629 0.0110918 -0.1911786 0.003883 0.040114 2.2001174 -0.311764 -0.2133661 -0.3183597 1.3511826 0.0746831 -0.2128596 0.0730109 0.2670246 -0.0088033 -0.0031156 0.0066522 -0.0556493 0.1449873 0.0105475 0.0046317 0.0045562 0.0452346 0.1267385 -0.104359 -0.0116878 -0.0820398 0.0600328 0.0097422 -0.0109005 0.0117917 0.0453795 0.0756824 0.0430307 0.0067379 0.0648421 0.0534355 -0.009536 0.007798 -0.0073061 0.1251632 0.0754929 -0.0544254 0.0021316 -0.0243101 -0.1112861 -0.009548 0.0036555 -0.0063621 0.1250961 -0.0374105 0.0903774 -0.0848351 -0.0028137 0.0787264 -0.0477457 -0.062985 -0.0411624 -0.0107267 -0.0054644 0.0886244 0.0924752 0.0015962 0.0702352 0.0584016 0.0621798 0.0325284 -0.0326999 0.0758157 -0.0187016 -0.0777323 0.0624261 -0.0230469 -0.089138 -0.0569395 -0.057603 -0.0142749 0.0981893 -0.0130473 0.0568522 0.0734003 -0.0332213 0.0746016 0.0419886 0.0593743 -0.0250623 -0.1274893 0.0024987 0.0241881 -0.0096619 0.0861258 -0.001157 0.0236663 -0.0022245 0.1287396 0.2492373 -0.104496 0.0117523 -0.1923505 0.2948836 0.0157857 0.0085549 0.0066448 0.4022064 unknown
polarizability: 208.8190016|0.6652485|162.1743451|-15.3563038|4.1997288|59.3158615 unknown
InChI: InChI=1S/C7H8N2O2S2/c1-12-5-4(6(10)11)3-8-7(9-5)13-2/h3,10H,1-2H3
charge 0 multiplicity 1
21 atoms
S  -0.885132 -2.276224 -0.157934
S  3.308959 1.209696 -0.441442
O  -3.274431 1.63496 0.244867
O  -3.245927 -0.687527 0.154406
N  1.072623 -0.376876 -0.279095
N  0.784007 2.041631 -0.155444
C  -1.157637 0.550715 -0.01373
C  -0.270982 -0.570552 -0.149864
C  -0.550822 1.838611 -0.026337
C  1.536773 0.900766 -0.275938
C  -2.614234 0.398906 0.131159
C  0.746919 -3.198881 -0.375107
C  3.968028 -0.547068 -0.568598
H  -1.178338 2.728316 0.072103
H  0.463314 -4.26269 -0.401754
H  1.413865 -2.99132 0.472761
H  1.228461 -2.896863 -1.315132
H  3.543569 -1.041534 -1.453185
H  3.707789 -1.108276 0.339399
H  5.05964 -0.442088 -0.664812
H  -4.249843 1.4659 0.338377
