program: Gaussian 09
title: 000239464
version: EM64L-G09RevD.01
frameworkgroup: C1[X(C11H9ClN2OS)]
method: RPBEPBE
basis: SDD
operation: Freq
keyword: #p
keyword: freq=noraman
keyword: PBEPBE/SDD
title: #p freq=noraman PBEPBE/SDD
converged: YES YES NO NO
title: Mulliken charges:
elementType: Cl S O N N C C C C C C C C C C C H H H H H H H H H
charge: -0.044589 0.265615 -0.228449 -0.409778 0.004211 0.566872 -0.805027 -0.303409 -0.353028 -0.034653 -0.214884 -0.228641 -0.217227 -0.138090 0.025900 -0.299321 0.290046 0.301125 0.245960 0.262335 0.240344 0.242562 0.343288 0.248854 0.239981
chargesum: 0.00000
title: Mulliken charges with hydrogens summed into heavy atoms:
elementType: Cl S O N N C C C C C C C C C C C
charge: -0.044589 0.265615 -0.228449 -0.066490 0.004211 0.566872 -0.213855 -0.303409 -0.107068 -0.034653 0.047452 0.011703 0.025335 0.110764 0.025900 -0.059340
polarizability: 2.65289858e+02 -1.69927033e+01 1.29896652e+02 -4.83075480e+00 3.50458361e+00 1.18718188e+02
1716.lowfreq: -6.9828 -3.5765 -0.0005 0.0019 0.0034 4.6850 10.4157 27.6575 50.1926
frequency: 10.1493 27.2823 50.1810 54.8062 117.0742 130.1063 144.8154 160.7822 217.4518 260.1741 284.0976 356.2141 404.6684 420.5660 425.7640 445.9675 482.8640 508.7637 558.0599 570.6474 604.9532 647.8801 661.8026 677.2757 707.2166 739.6083 763.8714 770.3338 778.3822 812.9360 823.4342 873.0942 901.3147 953.5591 954.6414 958.4639 991.6647 1012.3968 1019.9856 1038.5774 1090.7386 1109.4156 1120.0988 1152.4038 1176.8067 1219.6046 1248.9336 1283.0221 1340.4473 1358.2062 1378.6611 1406.7449 1427.3242 1453.8961 1465.4159 1494.0902 1565.2380 1576.7511 1605.5112 1651.8413 3038.7038 3113.2518 3122.7676 3133.5316 3147.9168 3165.9147 3179.5307 3215.1629 3500.1153
redmass: 9.7805 6.9352 7.2586 7.5505 6.3447 5.7616 5.6292 8.2394 7.0518 5.0098 6.0136 4.9389 9.7703 3.0346 4.0015 3.5628 6.5563 4.5105 8.9108 6.8495 6.0855 5.2679 6.4952 8.6126 1.5346 2.8033 1.7682 1.4637 1.9272 6.0604 5.0041 1.4309 1.4680 1.4443 1.3902 8.1629 1.3375 6.3068 6.1214 2.1367 2.6710 1.5071 1.6860 1.1479 1.0560 2.2562 1.2481 1.4431 1.3531 2.1659 8.2757 2.2594 2.1236 1.1346 2.5455 4.3558 5.5121 6.1428 7.0893 7.7506 1.0564 1.0910 1.1096 1.0884 1.0895 1.0950 1.0998 1.0938 1.0780
irintensity: 1.4658 0.1887 0.7432 0.4688 3.4022 3.7488 0.3454 2.4402 3.0903 2.7428 0.4305 3.7163 11.1991 11.8389 2.7488 7.0358 2.2254 0.9193 6.1512 15.3998 0.7514 24.5695 14.1234 22.8008 33.5357 26.6788 0.7257 55.2979 103.9114 2.5210 10.6354 0.1479 3.1927 1.5467 1.7418 3.2886 0.0293 74.0868 47.7958 3.5126 4.3179 3.8940 65.7431 1.3981 0.6296 2.3318 19.9119 5.1698 31.6468 49.2253 1.2058 22.2077 24.7469 32.4348 24.5475 526.5343 108.8946 10.6893 5.1454 729.5098 8.1794 25.8554 1.0364 3.9817 6.7989 11.0340 10.9944 1.4078 43.0536
temp: 298.150 k
press: 1.00000 atm
elementType: 17 16 8 7 7 6 6 6 6 6 6 6 6 6 6 6 1 1 1 1 1 1 1 1 1
symmnumber: 1
zpe: 466925.7 jmol-1
zpe.correction: 0.177843 hartree
zpe.thermalcorrener: 0.192328 hartree
zpe.thermalcorrenthalpy: 0.193272 hartree
zpe.thermalcorrgfe: 0.132564 hartree
zpe.sumelectzpe: -1466.279767 hartree
zpe.sumelectthermal: -1466.265281 hartree
zpe.sumelectthermalent: -1466.264337 hartree
zpe.sumelectthermalfe: -1466.325045 hartree
dipole: 9.4609 -1.6322 2.3767
dipole: 9.8904
quadrupole: -143.7836 -104.2986 -104.1800
quadrupole: -6.9708 -9.1149 -0.2811
quadrupole: -26.3629 13.1221 13.2408 -6.9708 -9.1149 -0.2811
hfenergy: -1466.4576094 hartree
pointgroup: C01 [X(C11H9Cl1N2O1S1)]
dipole: -3.7590846 0.2508984 0.9735335 debye
dipolederiv: -0.2109593 0.2098484 0.0661875 0.1481139 -0.5592965 -0.2263183 0.0414514 -0.2204868 -0.1618556 -0.9771401 0.0474016 -0.0348691 0.1712349 -0.0467326 0.008437 -0.1603341 0.0001138 -0.038533 -1.1350661 -0.1986151 0.3047396 -0.4428351 -0.5252128 0.2236526 0.652186 0.2152352 -0.7047894 -1.3908837 -0.2318294 0.3582291 0.1860256 -0.295433 0.0909634 -0.2037012 0.1046008 -0.3694574 -0.8631459 -0.007389 0.028909 -0.4973461 -0.422123 0.2400645 0.7181423 0.2203221 -0.6026064 0.0578943 0.0639896 0.0213252 -0.0168604 -0.2115914 -0.063539 0.0488415 -0.0654234 -0.0882863 0.5989178 0.1012614 -0.0877739 0.1757771 0.0864187 -0.0319808 -0.3125158 -0.0130415 0.1542259 0.2240425 -0.3880413 -0.1202096 -0.1631975 0.7860358 0.3874826 0.0001727 0.3692059 0.1283076 -0.008118 -0.0148556 0.057999 -0.0353602 0.0032225 0.0777365 0.0222824 0.0703066 -0.0622697 1.3597778 -0.0010806 -0.0342294 -0.6010085 0.3047237 -0.3204254 0.7788465 -0.3338009 0.5138256 -0.1514179 0.1624149 0.0875214 0.1469657 -0.2103815 -0.021976 0.0598922 -0.0109531 -0.0739411 -0.1168043 -0.0955907 -0.0341707 -0.1023718 0.0287055 0.0786747 -0.0589588 0.0657639 -0.1074147 0.0690513 -0.0278827 0.0795203 -0.0496794 0.0178568 0.0712185 0.052932 0.0879607 -0.0649096 -1.0919636 0.1660274 -0.2008159 0.4982356 -0.3048509 0.1610432 -0.6511366 0.1789551 -0.4093392 1.8563253 0.2757409 -0.4444028 0.5076198 0.5481774 -0.4194695 -0.7823231 -0.4115847 0.8728067 1.41632 -0.0945492 0.0804753 0.0890406 0.1704837 -0.2259534 -0.1897614 -0.2176144 0.3232489 -0.0135086 -0.0128355 -0.0077556 -0.1007637 0.0477404 -0.0341553 0.0473684 -0.0170711 -0.0641612 0.0106524 0.007503 0.0176221 0.0249506 -0.0195723 0.0477106 0.1242985 0.0271897 0.0588922 0.0477499 -0.0495608 -0.0804862 -0.0575834 0.0397213 -0.0715591 -0.0787542 -0.0787299 0.0659289 0.0622458 -0.0259747 -0.047244 -0.040388 0.0597018 -0.0775561 -0.0670527 -0.0735812 0.0979758 0.0489082 0.0718558 0.0087875 0.0959819 -0.020445 -0.0855554 0.0110546 -0.0867999 0.1130131 -0.0809141 0.0530311 -0.0513101 0.0523627 0.0891085 -0.0248881 -0.0557338 -0.0238102 0.1265474 0.2010242 0.0283859 -0.0324875 0.0361512 0.2709884 0.0521413 -0.0413684 0.0511477 0.2391158 0.0155509 -0.0494302 0.0782403 -0.0489258 0.1344363 0.054626 0.0741026 0.0526026 0.099162 0.0714613 0.0101748 -0.0138015 0.0238605 0.0283184 0.1096254 -0.0299311 0.1094931 -0.0454862 unknown
polarizability: 265.9577443|-14.4106981|130.1290907|3.9387389|-0.2037865|117.8178629 unknown
InChI: InChI=1S/C11H9ClN2OS/c12-9-4-2-1-3-8(9)7-16-10-5-6-13-11(15)14-10/h1-6,14H,7H2
charge 0 multiplicity 1
25 atoms
Cl -2.304889 -2.318028 -1.298274
S  0.337854 0.572574 -0.762922
O  5.322702 0.820676 -1.34572
N  3.048436 0.574822 -0.897482
N  4.700231 -0.49825 0.526445
C  -2.232816 0.063023 0.200599
C  -0.801435 -0.24825 0.548191
C  -3.02397 -0.782161 -0.617604
C  -2.847519 1.243589 0.699122
C  1.985973 0.088106 -0.166417
C  -4.364917 -0.490211 -0.932062
C  -4.187955 1.559532 0.396342
C  -4.948036 0.690754 -0.420408
C  2.270239 -0.713737 0.940794
C  4.453122 0.312073 -0.595525
C  3.652182 -0.96282 1.224058
H  -0.519628 0.179017 1.522927
H  -0.594246 -1.328611 0.515491
H  -2.254544 1.916251 1.329633
H  -4.940077 -1.172464 -1.564182
H  -4.637296 2.474885 0.79412
H  -5.990064 0.925091 -0.661269
H  2.901131 1.168186 -1.72118
H  1.492371 -1.144962 1.569182
H  3.902952 -1.591486 2.088843
