program: Gaussian 09
title: 000239463
version: EM64L-G09RevD.01
frameworkgroup: C1[X(C12H12ClN3S)]
method: RPBEPBE
basis: SDD
operation: Freq
keyword: #p
keyword: freq=noraman
keyword: PBEPBE/SDD
title: #p freq=noraman PBEPBE/SDD
converged: YES YES NO NO
title: Mulliken charges:
elementType: Cl S N N N C C C C C C C C C C C C H H H H H H H H H H H H
charge: -0.056954 0.220900 -0.047113 -0.099690 -0.589035 0.559303 -0.775052 -0.304740 -0.355109 -0.186968 -0.282830 0.253855 -0.220717 -0.232485 -0.223602 -0.775215 -0.071720 0.290434 0.302790 0.245332 0.245246 0.257022 0.233802 0.236250 0.232732 0.231333 0.252398 0.332449 0.327382
chargesum: 0.00000
title: Mulliken charges with hydrogens summed into heavy atoms:
elementType: Cl S N N N C C C C C C C C C C C C
charge: -0.056954 0.220900 -0.047113 -0.099690 0.070796 0.559303 -0.181827 -0.304740 -0.109777 -0.186968 -0.037584 0.253855 0.036305 0.001316 0.012649 -0.058752 -0.071720
polarizability: 2.75325092e+02 -1.63235053e+01 1.47732654e+02 3.89590406e+00 4.68987082e+00 1.39157150e+02
1716.lowfreq: -57.1829 -5.4899 -0.0017 -0.0012 -0.0011 2.4304 4.0898 8.4129 18.4852
frequency: -57.1678 7.2775 18.3644 50.0942 51.7872 105.2654 144.2834 146.6472 186.1732 211.1622 213.0569 253.6844 278.1278 293.2899 353.1381 402.0164 416.7199 447.4257 466.4539 473.0856 510.3526 530.8343 531.9127 565.8660 572.9624 590.1598 639.3049 653.1435 662.0610 739.6846 768.4424 781.4251 817.2223 835.4418 840.2342 870.2799 885.7544 911.3894 951.1146 980.1979 986.8149 991.8489 1019.0745 1039.1569 1046.8289 1064.2608 1102.3617 1143.4829 1150.4885 1173.4515 1216.7374 1245.6811 1278.8377 1280.1140 1296.2838 1375.9670 1382.8425 1391.0169 1424.1843 1439.2702 1442.3402 1466.0851 1467.7913 1474.1341 1527.8540 1534.4201 1575.0728 1605.4057 1606.4872 2988.2614 3060.3815 3068.7314 3120.0351 3131.8240 3138.2664 3144.3103 3161.8182 3172.9651 3176.5453 3561.3563 3720.9689
redmass: 1.0327 7.1408 5.7701 5.4471 7.5038 5.9655 5.0406 5.1088 5.4956 4.8656 4.9255 4.2014 5.1568 2.9152 4.4237 7.8734 4.5221 3.5590 1.2035 3.2207 4.2873 1.1815 5.3572 3.2367 6.2199 6.2608 4.6155 5.1877 6.6585 2.6674 1.5048 6.9940 4.4023 5.6041 1.3708 1.4189 1.5606 7.6760 1.3842 1.9435 1.3322 2.2505 6.2156 2.1175 1.5867 2.6893 1.4021 1.2016 1.5914 1.0549 1.9887 1.4256 3.1893 1.8562 3.9049 8.4176 1.9109 1.7426 2.0850 1.3981 1.3311 2.5854 1.0464 1.7629 5.1957 4.8932 6.1906 3.4019 2.0308 1.0378 1.0582 1.0973 1.0987 1.0871 1.1073 1.0902 1.0953 1.0935 1.0994 1.0441 1.1058
irintensity: 0.5630 0.3675 0.1966 0.3938 0.6814 0.7629 0.1564 0.3739 10.0597 3.1151 0.4890 1.7989 2.7086 8.6099 4.1304 6.0713 4.0903 7.3562 286.7309 2.3301 0.8166 1.8082 3.4681 2.6805 19.0481 7.5966 10.0141 15.1827 17.5256 25.8386 57.1765 7.0257 5.7919 68.6289 23.6191 0.2516 5.3264 0.4338 1.6373 1.9103 0.0420 27.1860 49.5339 4.2546 8.4598 3.1132 4.8154 0.3986 35.6967 0.3574 0.5768 31.9708 7.1826 1.8611 101.4640 1.5095 6.0427 31.1221 21.3839 2.7993 51.1675 31.5836 17.0135 65.3849 550.8975 265.2133 10.2782 121.3569 339.3272 16.1481 5.5884 16.4810 12.4954 3.2176 0.7754 10.1021 15.8492 1.1586 14.1357 105.2007 45.7921
temp: 298.150 k
press: 1.00000 atm
elementType: 17 16 7 7 7 6 6 6 6 6 6 6 6 6 6 6 6 1 1 1 1 1 1 1 1 1 1 1 1
symmnumber: 1
zpe: 570317.2 jmol-1
zpe.correction: 0.217222 hartree
zpe.thermalcorrener: 0.233029 hartree
zpe.thermalcorrenthalpy: 0.233973 hartree
zpe.thermalcorrgfe: 0.170230 hartree
zpe.sumelectzpe: -1485.653138 hartree
zpe.sumelectthermal: -1485.637331 hartree
zpe.sumelectthermalent: -1485.636387 hartree
zpe.sumelectthermalfe: -1485.700130 hartree
dipole: 0.5746 -0.4822 2.0267
dipole: 2.1610
quadrupole: -97.4226 -108.7766 -108.1182
quadrupole: -5.4827 2.4277 4.9317
quadrupole: 7.3499 -4.0042 -3.3457 -5.4827 2.4277 4.9317
hfenergy: -1485.87036 hartree
pointgroup: C01 [X(C12H12Cl1N3S1)]
dipole: -0.2448101 -0.7393419 0.3410358 debye
polarizability: 276.5632728|-0.4466172|141.4393026|-10.8799009|6.0892614|144.2123203 unknown
InChI: InChI=1S/C12H12ClN3S/c1-8-6-11(16-12(14)15-8)17-7-9-4-2-3-5-10(9)13/h2-6H,7,14H2,1H3
charge 0 multiplicity 1
29 atoms
Cl -2.661428 1.14662 -2.455284
S  -0.040768 0.880284 0.590153
N  1.892229 -0.736658 -0.511031
N  4.306904 -0.353829 -0.310511
N  3.451211 -2.182972 -1.496358
C  -2.470085 -0.339042 -0.068388
C  -0.995594 -0.50715 -0.323464
C  -3.33231 0.372178 -0.93966
C  -3.062018 -0.913042 1.090313
C  1.675777 0.382279 0.226285
C  2.731729 1.183015 0.728852
C  4.054278 0.769429 0.431393
C  -4.712768 0.51283 -0.69643
C  -4.440359 -0.785448 1.359505
C  -5.268989 -0.070894 0.463453
C  5.253478 1.552292 0.91835
C  3.20926 -1.054712 -0.748516
H  -0.607506 -1.456972 0.072414
H  -0.72785 -0.421599 -1.385818
H  -2.41523 -1.462163 1.784344
H  2.538877 2.082234 1.318483
H  -5.337996 1.068749 -1.400856
H  -4.86618 -1.239535 2.260225
H  -6.341106 0.034634 0.660049
H  5.238642 2.585137 0.524087
H  5.260559 1.621944 2.021695
H  6.178881 1.057795 0.586003
H  4.413735 -2.442318 -1.694026
H  2.668825 -2.725882 -1.850363
