program: Gaussian 09
title: 000239462
version: EM64L-G09RevD.01
frameworkgroup: C1[X(C11H10N2OS)]
method: RPBEPBE
basis: SDD
operation: Freq
keyword: #p
keyword: freq=noraman
keyword: PBEPBE/SDD
title: #p freq=noraman PBEPBE/SDD
converged: NO YES NO NO
title: Mulliken charges:
elementType: S O N N C C C C C C C C C C C H H H H H H H H H H
charge: 0.231094 -0.260392 -0.340054 -0.010715 0.473369 -0.796217 -0.374045 -0.377483 -0.190921 -0.220596 -0.220340 -0.234591 -0.256446 0.198831 -0.226202 0.289815 0.289217 0.238050 0.237796 0.228874 0.228890 0.231203 0.265060 0.342173 0.253631
chargesum: 0.00000
title: Mulliken charges with hydrogens summed into heavy atoms:
elementType: S O N N C C C C C C C C C C C
charge: 0.231094 -0.260392 0.002119 -0.010715 0.473369 -0.217185 -0.135994 -0.139687 -0.190921 0.008278 0.008549 -0.003388 0.008614 0.198831 0.027429
polarizability: 2.69727013e+02 3.35662781e+00 1.13150670e+02 7.23927374e-01 -6.82307257e-01 1.04244005e+02
1716.lowfreq: -14.1343 -5.0523 -3.0757 0.0013 0.0013 0.0014 5.9051 21.9849 49.2930
frequency: -6.4646 21.8942 49.2610 52.9316 124.4145 141.3552 178.0940 207.5530 278.5167 321.1807 401.8819 405.6670 412.3916 454.2206 478.9876 525.4597 557.6513 608.1140 616.3779 647.7379 695.7137 702.5113 715.9037 754.2700 776.2821 809.3683 840.7681 841.1687 852.1977 885.3866 915.7621 924.1090 926.9057 977.5187 989.9911 997.5977 1025.9926 1051.8300 1073.1490 1122.4510 1133.2764 1173.5622 1188.0354 1201.4275 1219.7595 1243.4804 1287.5595 1324.9225 1373.4448 1384.8181 1398.6493 1440.1662 1444.7171 1483.4465 1490.5050 1553.4589 1593.5823 1613.8175 1657.0891 3057.7687 3123.3597 3125.0504 3135.3417 3138.0565 3145.2417 3149.8506 3166.4057 3186.6425 3509.2510
redmass: 5.1099 4.5336 5.6903 6.4543 6.6743 6.2658 7.6474 6.0771 7.1656 2.2486 2.7987 11.9103 2.7344 6.0576 3.9574 9.5934 6.1655 3.9835 6.3268 4.8501 6.9625 1.7014 3.1185 1.5394 2.1688 3.9751 4.1398 1.6320 1.2504 1.5224 1.4052 7.1433 1.4891 1.3914 6.1048 1.3262 2.1978 3.8257 1.4802 1.0887 2.0588 1.0524 1.1140 2.3151 2.0493 1.4650 2.0205 1.2796 1.5945 8.8102 2.3068 2.1988 1.1158 2.3547 7.6027 4.7901 6.0978 6.1350 6.9543 1.0580 1.0853 1.0887 1.1082 1.0920 1.0936 1.0964 1.1017 1.0931 1.0786
irintensity: 0.0785 0.8866 0.3652 0.4067 0.7720 0.0865 11.5557 2.1028 1.9905 0.8161 0.0606 9.9318 18.2283 5.2223 11.2618 3.6337 21.6852 17.7828 0.0384 32.5838 23.5415 53.4384 7.0265 86.8486 29.2954 10.9119 21.0915 31.9665 0.0791 0.8300 1.4692 20.0180 1.0539 0.0105 0.7694 0.1043 8.4112 168.8639 9.0870 1.4683 12.4285 0.0247 1.7390 21.0988 1.6099 34.2281 27.4954 0.2610 86.1417 0.1872 8.7671 8.8364 15.7528 11.9559 26.4635 244.4209 0.9948 3.2022 875.2399 7.0325 6.5808 0.8010 2.8214 14.0073 15.1085 39.2423 24.3978 0.2233 59.1259
temp: 298.150 k
press: 1.00000 atm
elementType: 16 8 7 7 6 6 6 6 6 6 6 6 6 6 6 1 1 1 1 1 1 1 1 1 1
symmnumber: 1
zpe: 492294.7 jmol-1
zpe.correction: 0.187505 hartree
zpe.thermalcorrener: 0.199882 hartree
zpe.thermalcorrenthalpy: 0.200826 hartree
zpe.thermalcorrgfe: 0.146568 hartree
zpe.sumelectzpe: -1006.901921 hartree
zpe.sumelectthermal: -1006.889544 hartree
zpe.sumelectthermalent: -1006.888600 hartree
zpe.sumelectthermalfe: -1006.942858 hartree
dipole: -2.1399 4.0161 0.1852
dipole: 4.5544
quadrupole: -96.1027 -94.5700 -90.1371
quadrupole: 22.0521 0.9057 -0.3937
quadrupole: -2.4994 -0.9667 3.4662 22.0521 0.9057 -0.3937
hfenergy: -1007.0894259 hartree
pointgroup: C01 [X(C11H10N2O1S1)]
dipole: -0.814535 -0.9811845 1.2587916 debye
dipolederiv: -1.0854809 -0.0104267 0.0495608 0.1343928 -0.0432766 -0.0461596 -0.1211774 -0.039773 -0.0250799 -1.4833172 -0.2548677 0.3696225 -0.2600756 -0.4673592 0.1290727 0.3728192 0.1274095 -0.5525586 -0.7963603 0.0616371 -0.0575871 -0.2477652 -0.3997737 0.2015368 0.3367158 0.1901434 -0.5045045 -1.011901 0.2378959 -0.2706993 0.3240105 -0.4305812 0.2968107 -0.372107 0.2993926 -0.5532247 0.2041968 0.0015189 -0.0087862 -0.0452609 -0.043528 0.0396799 0.0500139 0.0380332 -0.0606977 0.6248082 0.092684 -0.1279342 0.2240323 0.1450224 -0.0430613 -0.2952573 -0.0397416 0.1731503 -0.098814 -0.0812549 -0.0281682 -0.0226913 -0.0152562 0.0822162 -0.0024655 0.0880084 -0.0748222 -0.0957704 0.0454765 0.0784447 0.0073127 -0.0431856 0.0916615 0.0245293 0.0871734 -0.0484177 1.8707429 -0.1288482 0.0854568 -0.3478771 0.2210555 -0.2707033 0.3470736 -0.2770762 0.3449614 -0.041723 0.0547362 0.0867017 0.0822694 -0.0278501 0.1020881 0.0967321 0.112036 -0.0278615 -0.0486544 -0.0922097 -0.0361801 -0.1063958 0.0142441 0.1075476 -0.0627959 0.098306 -0.0638226 0.053556 -0.0448906 0.0521397 -0.0343854 -0.089561 0.0449987 0.0399004 0.0453505 -0.1076073 -1.5642149 -0.1358902 0.2286374 0.0486238 -0.1276591 -0.0398306 -0.0032658 -0.0332143 -0.1164245 1.9957169 0.3132366 -0.4719379 0.1500443 0.4999954 -0.3781881 -0.261782 -0.3838894 0.7086833 1.1550172 -0.1906965 0.1991874 0.0348282 0.1686714 -0.1566183 -0.0882475 -0.1471092 0.2374351 -0.0097373 -0.0190747 0.0100729 -0.0957164 0.0484049 -0.0227875 0.0337422 -0.0023237 -0.0677051 -0.0122838 -0.0054497 0.0224195 -0.0161081 -0.0676028 0.021442 0.1030446 -0.0020039 0.0451109 0.0576161 0.0965382 0.0370941 0.0936702 0.0092415 -0.0867222 0.0404527 -0.0802022 0.0793499 0.0517162 -0.0560327 -0.0907666 -0.0581696 0.0501453 -0.0843543 -0.0865396 -0.0915359 0.0441369 0.0139134 -0.0499621 -0.074374 -0.0619563 0.0400144 -0.1105842 -0.0990371 -0.111008 0.0433388 0.0192346 0.0803317 0.0347238 0.106641 -0.0002242 -0.1072048 0.0417036 -0.1064889 0.0779897 -0.1305369 0.0410337 -0.0443049 0.0441601 0.1111129 -0.0283188 -0.0482178 -0.0282885 0.123196 0.1015999 0.0159574 -0.016985 0.0344877 0.1057044 0.0797221 -0.0409044 0.0799939 0.0684345 0.1922798 0.0024205 0.0029474 -0.0337757 0.2795316 0.0772848 0.049318 0.07577 0.2405332 0.0383961 0.0261369 -0.0292854 0.0457045 0.0627139 0.1004718 -0.0542482 0.1010381 0.0164063 unknown
polarizability: 269.7052846|-3.5291132|106.6911129|-1.8831998|-3.9392255|110.7252903 unknown
InChI: InChI=1S/C11H10N2OS/c14-10-6-11(13-8-12-10)15-7-9-4-2-1-3-5-9/h1-6,8,12H,7H2
charge 0 multiplicity 1
25 atoms
S  0.110397 0.609521 -0.708301
O  5.318844 0.776231 -1.146294
N  4.323515 -0.517948 0.540465
N  1.967418 -0.690466 0.856422
C  -2.378458 -0.165597 0.3127
C  -0.911366 -0.405484 0.568526
C  -3.097535 -0.990456 -0.591083
C  -3.064403 0.88645 0.9735
C  1.810191 0.173868 -0.23464
C  -4.473414 -0.773552 -0.82441
C  -4.440371 1.105381 0.741828
C  -5.148933 0.275404 -0.157934
C  2.880647 0.703613 -0.954297
C  4.250495 0.376754 -0.598326
C  3.213651 -0.996324 1.194409
H  -0.584478 -0.067596 1.562483
H  -0.615485 -1.455812 0.431952
H  -2.575218 -1.802442 -1.111185
H  -2.517154 1.533134 1.669872
H  -5.017273 -1.420127 -1.521925
H  -4.95854 1.91916 1.26113
H  -6.216579 0.443881 -0.337513
H  2.7332 1.375207 -1.80289
H  5.268769 -0.781629 0.837858
H  3.381378 -1.66827 2.042953
