program: Gaussian 09
title: 000239461
version: EM64L-G09RevD.01
frameworkgroup: C1[X(C14H16O6)]
method: RPBEPBE
basis: SDD
operation: Freq
keyword: #pfreq=noraman
keyword: PBEPBE/SDD
title: #p freq=noraman PBEPBE/SDD
converged: YES YES NO NO
title: Mulliken charges:
elementType: O O O O O O C C C C C C C C C C C C C C H H H H H H H H H H H H H H H H
charge: -0.263974 -0.261672 -0.250231 -0.280376 -0.249724 -0.220430 0.481562 -0.161347 0.199752 -0.508382 0.167264 -0.358558 -0.327904 -0.203976 0.319646 0.303613 -0.484405 -0.492030 -0.660484 -0.659503 0.281377 0.292075 0.264255 0.252223 0.235831 0.241602 0.248066 0.243921 0.247300 0.247567 0.236750 0.215181 0.225251 0.228601 0.218079 0.233080
chargesum: 0.00000
title: Mulliken charges with hydrogens summed into heavy atoms:
elementType: O O O O O O C C C C C C C C C C C C C C
charge: -0.263974 -0.261672 -0.250231 -0.280376 -0.249724 -0.220430 0.481562 0.120031 0.199752 -0.216307 0.167264 -0.094303 -0.075681 0.273457 0.319646 0.303613 0.007582 0.002838 0.016697 0.020257
polarizability: 2.27991318e+02 -2.42343205e-03 1.60652115e+02 -4.64008616e+00 -2.16195221e+01 1.28820538e+02
1716.lowfreq: -6.7078 -3.7129 -0.0005 0.0002 0.0005 1.4851 11.1445 16.9383 27.9226
frequency: 9.5123 16.6911 27.9153 35.1137 43.7792 52.9699 57.3540 62.8287 63.9994 128.6900 162.6854 181.9613 187.2487 189.6799 215.5273 218.3225 240.8552 270.6876 289.0900 318.4271 345.6821 403.5661 419.7296 490.9309 517.8668 539.2435 544.8653 556.4799 600.4354 629.1283 648.7212 657.2340 681.3143 724.3435 768.3788 777.3030 790.4084 792.8065 816.6331 833.4323 837.1037 846.6473 864.6721 893.6954 917.1272 947.9292 972.3960 993.3399 1007.6507 1022.3734 1057.0861 1062.7521 1068.1483 1080.5668 1086.0322 1086.5525 1109.2316 1122.6031 1129.4242 1136.7908 1183.6576 1242.5171 1244.6293 1249.6774 1276.4069 1317.3589 1326.5042 1343.3441 1345.1257 1364.5749 1398.6266 1401.1791 1409.4338 1441.3472 1442.1473 1446.2721 1472.2518 1472.3840 1479.4109 1481.5770 1482.0001 1487.8270 1610.2765 1630.6201 1646.7595 1669.7951 2996.6506 2997.0521 3000.2990 3001.3174 3008.4158 3046.1869 3050.4434 3051.3691 3096.3959 3098.9760 3100.7683 3104.2006 3105.6521 3169.0207 3171.0545 3188.1401
redmass: 2.1649 4.8628 2.4659 3.3784 2.7819 3.3995 3.3089 5.1957 6.3585 5.4989 3.5672 3.3231 1.2271 1.6043 4.3376 6.6490 6.4192 5.7395 5.1367 4.8985 6.1169 5.2469 3.1482 4.2420 4.5866 3.6371 3.8777 4.2492 5.7884 5.0738 4.4835 5.6866 9.0825 4.5607 5.0830 5.2914 1.4037 1.3602 1.8479 5.5230 5.7392 3.3458 5.1467 1.6053 3.6885 1.3563 6.4943 3.2537 2.3294 2.0500 2.7942 3.3531 1.4788 2.9723 1.6354 1.6544 2.5601 1.0508 2.8203 1.4132 1.6197 1.1747 1.1779 3.6147 1.4852 1.2051 1.7175 1.6842 1.9823 1.2676 1.2100 1.2114 3.2789 1.0868 1.0838 4.6639 1.0391 1.0393 1.9922 1.0527 1.0510 1.4658 7.8613 8.1146 9.4452 10.0254 1.0587 1.0597 1.0399 1.0382 1.0574 1.0978 1.0969 1.0861 1.1004 1.1005 1.1145 1.1004 1.1003 1.0888 1.0940 1.0971
irintensity: 0.1060 0.1678 0.1845 0.8601 8.8846 5.5222 2.9676 4.4321 0.7544 2.2111 0.4382 0.5550 0.3817 0.2472 0.8309 0.2809 2.3830 0.8113 21.9380 12.1920 5.2142 12.0096 3.5294 1.8785 6.4557 2.4117 14.2210 1.3175 2.7902 12.9765 3.6500 3.5938 1.6807 1.1882 20.6500 11.5940 13.2260 15.1014 193.4534 46.6919 34.9577 110.8213 38.5387 13.2578 62.5529 3.3362 188.2096 18.7689 158.9620 119.9610 203.2530 43.1556 6.0114 111.5979 2.2519 0.2223 130.0016 3.6533 312.5231 14.2071 2.0254 0.4200 2.9856 205.0616 37.5081 21.7765 98.8597 41.1584 5.7563 0.6041 18.3814 19.5034 19.6436 34.6237 26.8749 82.5467 12.8056 13.2306 63.9229 15.7512 14.5070 43.4846 11.1858 1.0300 102.0604 184.6929 23.9582 22.3121 18.0298 19.5481 125.0868 3.2610 3.3442 6.5654 30.4283 27.4059 30.2366 29.4269 27.1130 2.4258 0.8799 3.7167
temp: 298.150 k
press: 1.00000 atm
elementType: 8 8 8 8 8 8 6 6 6 6 6 6 6 6 6 6 6 6 6 6 1 1 1 1 1 1 1 1 1 1 1 1 1 1 1 1
symmnumber: 1
zpe: 727363.1 jmol-1
zpe.correction: 0.277038 hartree
zpe.thermalcorrener: 0.297675 hartree
zpe.thermalcorrenthalpy: 0.298620 hartree
zpe.thermalcorrgfe: 0.221997 hartree
zpe.sumelectzpe: -992.924684 hartree
zpe.sumelectthermal: -992.904046 hartree
zpe.sumelectthermalent: -992.903102 hartree
zpe.sumelectthermalfe: -992.979724 hartree
dipole: 0.3959 -1.8040 2.2025
dipole: 2.8744
quadrupole: -100.5552 -108.4732 -119.3295
quadrupole: 4.5130 -9.4995 5.2760
quadrupole: 8.8974 0.9794 -9.8769 4.5130 -9.4995 5.2760
hfenergy: -993.2017215 hartree
pointgroup: C01 [X(C14H16O6)]
dipole: -0.0861936 -0.589355 -0.9613114 debye
polarizability: 226.6584068|9.8076994|154.9651468|-7.8954859|24.5339979|135.8404178 unknown
InChI: InChI=1S/C14H16O6/c1-3-12(15)19-14(20-13(16)4-2)9-5-6-10-11(7-9)18-8-17-10/h5-7,14H,3-4,8H2,1-2H3
charge 0 multiplicity 1
36 atoms
O  -4.110488 -0.136749 1.186112
O  -4.646404 -1.493622 -0.722584
O  1.147846 1.138939 -0.542985
O  1.736918 -1.122396 -0.387223
O  0.62708 2.327379 1.402007
O  3.445879 -0.246347 0.953185
C  -0.606765 -0.568256 -0.11539
C  0.811432 -0.14374 0.168127
C  -2.93253 -0.481176 0.476374
C  -1.623003 -0.107719 0.773618
C  -3.249642 -1.277304 -0.645964
C  -0.925551 -1.364012 -1.242119
C  -2.26628 -1.734611 -1.527102
C  -5.209456 -0.875474 0.510527
C  1.078716 2.310387 0.235949
C  3.077414 -1.053623 0.079031
C  1.61718 3.492186 -0.55066
C  3.922443 -2.083525 -0.645425
C  1.343795 4.841202 0.137982
C  5.350044 -2.188123 -0.08056
H  1.011801 0.025054 1.24152
H  -1.381051 0.525117 1.632041
H  -0.117784 -1.70748 -1.8933
H  -2.520789 -2.350817 -2.3927
H  -5.571572 -1.677306 1.179652
H  -5.999124 -0.162525 0.224497
H  2.705415 3.328796 -0.680236
H  1.184551 3.454733 -1.567537
H  3.393068 -3.053815 -0.600371
H  3.937864 -1.802452 -1.7169
H  1.770863 4.856962 1.154725
H  1.790831 5.665443 -0.445036
H  0.260042 5.02822 0.23088
H  5.337193 -2.501371 0.977419
H  5.934848 -2.926917 -0.655761
H  5.867616 -1.215258 -0.130891
