program: Gaussian 09
title: 000019712
version: EM64L-G09RevD.01
frameworkgroup: C1[X(C6H14NO4PS3)]
method: RPBEPBE
basis: SDD
operation: Freq
keyword: #p
keyword: freq=noraman
keyword: PBEPBE/SDD
title: #p freq=noraman PBEPBE/SDD
converged: NO YES NO NO
title: Mulliken charges:
elementType: S S S P O O O O N C C C C C C H H H H H H H H H H H H H H
charge: 0.226078 0.058267 -0.220887 0.612312 -0.471262 -0.474921 -0.297890 -0.279428 -0.618448 -0.685900 -0.850099 -0.222336 -0.477633 -0.481286 0.306581 0.256216 0.340153 0.323915 0.319121 0.245414 0.239593 0.240987 0.255468 0.245099 0.247004 0.251471 0.234773 0.335333 0.342306
chargesum: 0.00000
title: Mulliken charges with hydrogens summed into heavy atoms:
elementType: S S S P O O O O N C C C C C C
charge: 0.226078 0.058267 -0.220887 0.612312 -0.471262 -0.474921 -0.297890 -0.279428 0.059191 -0.089531 -0.207063 0.262671 0.263921 0.251962 0.306581
polarizability: 2.10216238e+02 1.93288265e+01 1.61507635e+02 4.07446464e+00 4.58773376e+00 1.37877929e+02
1716.lowfreq: -8.4503 -0.0018 -0.0014 -0.0007 3.3516 6.0869 14.8555 19.2499 28.0218
frequency: 14.7847 18.8109 27.9844 37.3802 54.7670 59.7102 72.8552 87.0924 99.9909 106.5101 118.3661 128.8525 147.8927 155.7659 173.1892 187.0517 211.0160 215.0137 240.5158 269.6548 299.2485 342.0832 357.5577 386.8827 422.6328 452.4804 499.0806 511.2335 528.1646 566.2525 608.2174 618.9310 651.2298 656.2341 685.0785 703.9005 767.8088 807.3076 917.7005 950.1756 969.4081 980.9242 1011.0930 1057.3336 1082.6107 1116.6539 1118.5498 1127.9610 1139.2505 1160.6810 1189.5271 1214.4630 1228.2645 1292.0957 1316.7354 1378.9288 1389.3884 1424.8821 1430.3723 1450.8997 1453.3679 1456.3724 1464.3867 1470.1478 1470.4385 1588.5439 1689.7976 2981.7568 2985.6043 3002.3676 3023.5135 3043.5951 3065.3861 3086.5660 3088.2819 3107.7026 3132.3365 3133.3044 3133.9146 3558.9176 3716.4358
redmass: 8.8495 6.8556 5.8002 6.2017 3.9129 3.8959 3.2520 2.8863 4.7703 1.3970 1.3494 4.0077 5.0510 4.7551 5.3338 4.2361 4.4250 3.0692 3.8714 4.7232 6.0969 4.9437 6.9978 8.2815 3.5208 3.0158 1.2043 1.0540 13.2387 8.1222 3.7239 5.6882 11.1475 9.1204 12.1979 10.8494 2.4743 1.6261 2.2426 11.0992 2.5120 10.9097 2.0845 2.0184 2.7252 1.2412 1.2509 1.2913 1.2968 1.0410 1.1404 1.1009 1.1947 2.0641 1.3382 1.6043 1.0756 1.1180 1.1152 1.0638 1.0488 1.0802 1.0505 1.0597 1.0728 1.2108 7.5121 1.0298 1.0300 1.0568 1.0596 1.0554 1.1069 1.1056 1.1052 1.1070 1.1032 1.1026 1.1098 1.0445 1.1058
irintensity: 1.5802 0.8328 1.8701 0.7532 7.3912 0.7437 1.7357 2.3241 1.4359 1.4218 1.2077 4.1362 4.2001 8.7581 2.2773 3.9816 4.6269 13.7150 7.4200 4.7779 5.3061 6.0845 22.8472 25.7225 6.4093 3.7220 271.1683 1.4611 203.3872 21.4855 2.3848 2.7314 50.2288 55.2492 163.0783 31.1558 20.5579 17.0868 32.7788 237.6905 76.3073 20.7325 56.1882 18.5185 75.3630 0.1153 0.2759 1.0305 0.0266 1.5030 5.1811 34.8381 5.3163 378.7768 76.5611 45.2901 13.2947 7.8993 2.6216 8.2312 15.0882 15.1660 11.9864 11.8913 28.5743 110.9248 378.6353 38.3657 40.9390 13.3333 35.4224 4.7934 14.7848 14.6697 25.4216 9.5332 7.9454 6.1425 2.2206 53.6345 55.4134
temp: 298.150 k
press: 1.00000 atm
elementType: 16 16 16 15 8 8 8 8 7 6 6 6 6 6 6 1 1 1 1 1 1 1 1 1 1 1 1 1 1
symmnumber: 1
zpe: 555618.5 jmol-1
zpe.correction: 0.211624 hartree
zpe.thermalcorrener: 0.232867 hartree
zpe.thermalcorrenthalpy: 0.233811 hartree
zpe.thermalcorrgfe: 0.156699 hartree
zpe.sumelectzpe: -2126.871787 hartree
zpe.sumelectthermal: -2126.850544 hartree
zpe.sumelectthermalent: -2126.849599 hartree
zpe.sumelectthermalfe: -2126.926712 hartree
dipole: -0.2827 0.4673 0.1270
dipole: 0.5607
quadrupole: -133.4385 -110.4044 -117.9479
quadrupole: -18.9245 -19.2810 10.3460
quadrupole: -12.8415 10.1925 2.6490 -18.9245 -19.2810 10.3460
hfenergy: -2127.0834107 hartree
pointgroup: C01 [X(C6H14N1O4P1S3)]
dipole: 0.0816948 -0.2014757 -0.0373637 debye
polarizability: 214.6129953|12.6139017|156.8096658|-3.1948162|3.7610949|138.1791411 unknown
InChI: InChI=1S/C4H8NO2S2.C2H6O2PS/c5-4(6)7-1-2-9-3-8;1-3-5(6)4-2/h1-3,5H2;1-2H3
charge 0 multiplicity 1
29 atoms
S  -0.913833 -1.153805 -1.530771
S  2.187662 -0.49563 -2.155861
S  4.554339 1.331809 -0.054096
P  2.828702 0.205828 -0.070653
O  1.387784 0.870624 0.634398
O  2.756489 -1.240892 0.894695
O  -2.597291 0.724995 0.417087
O  -4.693161 0.739881 1.502299
N  -3.867484 2.61125 0.343936
C  -1.074216 -1.168039 0.368624
C  0.834745 -1.778478 -1.705505
C  -2.462404 -0.707122 0.786087
C  0.857591 2.118043 0.034006
C  4.032916 -1.931861 1.189547
C  -3.814773 1.318655 0.817322
H  -0.926035 -2.208159 0.707346
H  -0.287445 -0.520087 0.785065
H  1.154749 -2.293133 -0.786543
H  0.862713 -2.473754 -2.558394
H  -2.585855 -0.808272 1.880476
H  -3.268661 -1.282216 0.294493
H  1.577186 2.943988 0.174164
H  -0.073976 2.307086 0.58698
H  0.633979 1.965922 -1.037853
H  3.751143 -2.732317 1.889286
H  4.752885 -1.240285 1.661006
H  4.471398 -2.360858 0.270282
H  -3.126825 2.975982 -0.249692
H  -4.684921 3.174546 0.559568
