program: Gaussian 09
title: 000239458
version: EM64L-G09RevD.01
frameworkgroup: C1[X(C13H13NO8)]
method: RPBEPBE
basis: SDD
operation: Freq
keyword: #p
keyword: freq=noraman
keyword: PBEPBE/SDD
title: #p freq=noraman PBEPBE/SDD
converged: YES YES NO NO
title: Mulliken charges:
elementType: O O O O O O O O N C C C C C C C C C C C C C H H H H H H H H H H H H H
charge: -0.268891 -0.246545 -0.302430 -0.203396 -0.202639 -0.219990 -0.245438 -0.194352 0.017053 0.366587 -0.144359 0.181380 -0.468964 0.407461 -0.279550 -0.370436 0.315196 0.324511 0.274398 -0.751645 -0.751562 -0.761240 0.312192 0.317009 0.277725 0.291998 0.257945 0.256662 0.250545 0.248337 0.259887 0.255343 0.304449 0.244259 0.248504
chargesum: 0.00000
title: Mulliken charges with hydrogens summed into heavy atoms:
elementType: O O O O O O O O N C C C C C C C C C C C C C
charge: -0.268891 -0.246545 -0.302430 -0.203396 -0.202639 -0.219990 -0.245438 -0.194352 0.017053 0.366587 0.167833 0.181380 -0.151954 0.407461 -0.001826 -0.078438 0.315196 0.324511 0.274398 0.013507 0.012005 0.035973
polarizability: 2.30512574e+02 1.71199932e+01 2.03318563e+02 -7.67363049e+00 -8.86545898e+00 1.18393241e+02
1716.lowfreq: -4.2556 -0.0007 0.0005 0.0007 5.3826 6.7600 20.5761 28.2308 45.4433
frequency: 20.5523 28.1946 45.4381 47.6400 56.1012 57.9325 60.9568 70.4114 79.3214 83.0433 90.5825 99.3829 142.8307 153.1126 163.5799 166.3329 213.7634 228.4338 243.7029 254.0772 277.3181 324.6047 341.6865 405.3959 418.3030 424.6801 486.7836 500.8409 520.9781 538.8013 551.2105 552.7301 565.9599 568.2366 600.9717 616.9192 641.9819 661.5540 700.0570 718.0746 757.7425 772.9033 826.5595 840.6502 846.1969 869.7809 885.7128 939.3070 950.7611 977.4385 984.3083 985.9241 987.8742 1015.4048 1042.6108 1043.8970 1050.2482 1075.9935 1115.8893 1144.3013 1171.2704 1176.1858 1195.1254 1218.2648 1223.7221 1262.6986 1328.8089 1334.6283 1369.0415 1385.1558 1386.3514 1387.0659 1409.9206 1429.4580 1449.2335 1451.5743 1451.7628 1453.2796 1453.9650 1459.6719 1475.2635 1594.0856 1612.3928 1659.5221 1677.7194 1697.5513 3006.6533 3008.2094 3008.8648 3080.3291 3098.3628 3099.0910 3101.2010 3144.8520 3145.6491 3146.2907 3181.1397 3190.7221 3201.3492
redmass: 6.7066 9.9999 5.4412 7.2818 1.8469 3.5477 2.5520 4.3740 1.9279 1.6377 4.3357 3.5393 1.3549 3.2282 6.1054 6.7768 7.1492 6.1509 8.7235 5.8479 5.0222 4.6860 4.9977 4.7955 4.1881 4.9877 3.7398 6.3730 4.9683 4.6570 3.5835 3.4844 3.7777 4.1012 6.0599 5.6331 5.7819 6.9789 6.0363 7.0575 4.6196 7.7798 3.6788 7.0051 2.1462 5.3899 7.8514 4.1256 1.5028 2.9235 1.3532 2.1159 2.2432 3.0072 1.6694 1.6613 1.6284 2.1501 2.1955 2.5321 2.9906 1.6910 4.0259 7.5415 2.9901 1.5090 1.2218 1.6407 9.5618 1.2387 1.2354 1.2461 6.0743 4.1101 1.0505 1.0558 1.0529 1.0532 1.0535 1.0569 3.1030 7.6752 8.0358 9.7132 10.1363 10.5331 1.0372 1.0381 1.0377 1.0861 1.0958 1.0957 1.0947 1.1022 1.1016 1.1019 1.0899 1.0926 1.0969
irintensity: 0.4631 0.7243 2.0789 1.1071 2.6326 0.4187 1.6637 0.4426 1.6319 1.1510 2.9626 4.3642 2.6074 6.2144 1.3618 2.1699 5.3156 1.8522 5.5151 0.3395 5.1965 5.1209 1.3777 5.4224 2.6075 5.9604 22.8281 0.5431 25.3928 3.6883 7.8510 2.2382 12.4123 14.8601 1.2499 0.6134 8.7620 20.5227 22.4279 59.6740 8.5726 3.7977 36.8881 73.2565 28.7115 350.2662 37.5544 54.9709 8.1774 128.3638 1.8174 35.7688 127.5713 141.3443 8.9769 10.8475 20.1165 111.2302 117.9531 444.3298 295.1769 4.1517 551.4768 95.8491 121.4892 21.9847 1.4694 6.9353 124.5947 56.1578 89.3482 35.1161 9.8878 25.8695 10.4399 34.9649 16.2285 18.7227 18.9651 26.1314 33.7960 23.1995 24.6557 132.0202 255.1895 173.1918 6.2937 0.5860 0.3595 4.0432 4.7687 2.0035 4.8265 6.3939 8.1776 9.8863 1.2829 5.6280 2.2424
temp: 298.150 k
press: 1.00000 atm
elementType: 8 8 8 8 8 8 8 8 7 6 6 6 6 6 6 6 6 6 6 6 6 6 1 1 1 1 1 1 1 1 1 1 1 1 1
symmnumber: 1
zpe: 651740.0 jmol-1
zpe.correction: 0.248235 hartree
zpe.thermalcorrener: 0.271022 hartree
zpe.thermalcorrenthalpy: 0.271966 hartree
zpe.thermalcorrgfe: 0.192555 hartree
zpe.sumelectzpe: -1158.039698 hartree
zpe.sumelectthermal: -1158.016910 hartree
zpe.sumelectthermalent: -1158.015966 hartree
zpe.sumelectthermalfe: -1158.095378 hartree
dipole: 3.9369 -0.3406 -1.4219
dipole: 4.1996
quadrupole: -151.7424 -118.1457 -116.6801
quadrupole: -9.1219 9.1577 -3.1899
quadrupole: -22.8863 10.7104 12.1760 -9.1219 9.1577 -3.1899
hfenergy: -1158.2879322 hartree
pointgroup: C01 [X(C13H13N1O8)]
dipole: -1.4718683 -0.0652272 0.7478723 debye
polarizability: 231.1436862|-18.3143625|198.4739705|-13.8393081|-14.9496003|122.6067204 unknown
InChI: InChI=1S/C13H13NO8/c1-7(15)20-12-5-4-10(14(18)19)6-11(12)13(21-8(2)16)22-9(3)17/h4-6,13H,1-3H3
charge 0 multiplicity 1
35 atoms
O  -0.495178 -1.735832 1.375021
O  -1.366268 -1.213044 -0.742337
O  -0.713802 2.191974 0.505306
O  5.129343 0.061495 -0.981655
O  4.038513 -1.903948 -0.592697
O  -2.775874 -1.975629 1.843912
O  -3.005318 0.45409 -0.867716
O  -0.712392 3.693765 -1.310946
N  4.073358 -0.615685 -0.674431
C  0.471677 0.122718 0.200425
C  -0.812515 -0.606787 0.507386
C  0.486533 1.541837 0.140267
C  1.660143 -0.585077 -0.066091
C  2.824648 0.13384 -0.397868
C  1.659625 2.254077 -0.199565
C  2.841744 1.544853 -0.472929
C  -1.606493 -2.374644 1.996034
C  -2.530273 -0.623039 -1.282334
C  -1.291177 3.230708 -0.317493
C  -1.129173 -3.554812 2.803405
C  -3.073581 -1.481309 -2.397985
C  -2.65174 3.564349 0.225002
H  -1.589689 0.040692 0.946956
H  1.684983 -1.675804 -0.013708
H  1.640731 3.344198 -0.247118
H  3.769688 2.058581 -0.735907
H  -0.806335 -4.362046 2.1214
H  -0.25739 -3.277521 3.418425
H  -1.94548 -3.924889 3.439925
H  -3.764483 -0.892471 -3.018552
H  -3.624307 -2.334759 -1.961968
H  -2.254917 -1.89035 -3.01111
H  -3.323064 2.716707 -0.004259
H  -3.031807 4.481352 -0.247225
H  -2.619128 3.677215 1.321027
