program: Gaussian 09
title: 000239455
version: EM64L-G09RevD.01
frameworkgroup: C1[X(C11H14O3)]
method: RPBEPBE
basis: SDD
operation: Freq
keyword: #pfreq=noraman
keyword: PBEPBE/SDD
title: #p freq=noraman PBEPBE/SDD
converged: YES YES NO NO
title: Mulliken charges:
elementType: O O O C C C C C C C C C C C H H H H H H H H H H H H H H
charge: -0.242510 -0.435545 -0.236980 -0.425123 -0.572014 -0.002189 0.519202 -0.723859 -0.410280 -0.371217 -0.383140 -0.350572 0.278264 0.010026 0.220046 0.257008 0.215080 0.227642 0.253764 0.239580 0.232972 0.211175 0.230288 0.235130 0.216595 0.249339 0.205494 0.351827
chargesum: 0.00000
title: Mulliken charges with hydrogens summed into heavy atoms:
elementType: O O O C C C C C C C C C C C
charge: -0.242510 -0.083718 -0.236980 0.051930 -0.129292 0.251575 0.519202 -0.040132 -0.179993 -0.136088 -0.166545 -0.101233 0.278264 0.215519
polarizability: 1.64834572e+02 4.81109964e-01 1.31868169e+02 1.03295030e+01 4.58399963e+00 8.22469897e+01
1716.lowfreq: -12.4623 0.0002 0.0007 0.0008 3.3564 5.4537 20.5870 28.7340 39.7579
frequency: 19.8804 28.4955 39.6221 69.3980 94.9151 159.7119 184.5300 193.4408 223.3884 272.2368 294.2712 338.3582 345.0397 369.8948 401.8188 410.3708 421.1587 467.6003 526.1427 589.9272 637.0509 692.4471 717.4179 749.6222 766.9802 780.4129 805.2463 826.0827 837.7541 892.3266 929.5015 955.9511 960.9400 961.9271 976.9753 1004.6291 1048.4548 1092.7851 1096.3063 1118.6643 1142.4037 1147.2345 1178.2439 1189.8770 1217.3936 1245.8214 1267.8557 1276.3726 1315.6997 1325.6321 1332.9544 1344.9895 1363.2703 1391.3488 1394.6164 1426.0568 1457.4723 1466.3939 1483.0549 1485.5609 1505.7762 1598.3490 1617.8138 1627.7379 2984.5211 2992.3492 2996.3508 3024.5065 3028.7569 3034.9787 3060.1174 3092.9577 3103.4402 3107.1481 3122.1594 3133.5199 3169.0330 3583.3274
redmass: 3.9402 6.2793 5.7387 4.8944 2.9561 3.3722 4.5677 2.5444 1.3363 2.7735 2.6428 2.5685 1.1176 4.7692 3.2869 2.9481 3.2282 5.3265 2.5454 3.8446 6.7554 3.9772 3.6210 3.3639 3.4577 1.4890 1.4538 2.2777 2.2684 2.5683 1.4439 1.6232 1.4742 1.4852 1.8539 2.7495 1.8020 2.9050 2.5057 1.5717 1.3756 1.6164 1.1146 1.4799 2.1445 2.9166 1.4698 1.2192 1.2825 1.2461 1.6054 1.1244 1.3702 4.4724 1.3493 2.8064 1.0662 1.0609 1.0762 1.0746 2.7842 6.4154 8.6357 6.4898 1.0606 1.0599 1.0367 1.0866 1.0910 1.0990 1.1031 1.0989 1.1003 1.0875 1.0899 1.0962 1.0951 1.0660
irintensity: 0.3186 0.3699 1.6820 0.4021 0.1258 0.3247 2.8960 3.4658 1.5551 16.9432 5.9268 3.7573 142.4580 2.1857 4.2164 0.7848 23.1507 10.0328 35.2745 0.4274 0.9742 1.0932 0.6377 10.7120 11.1369 6.3280 34.3183 15.4946 29.3082 3.2585 0.5882 4.1024 0.8935 1.9295 6.3262 4.7494 77.2750 135.6887 142.0244 46.3850 208.1166 7.4235 5.4294 8.8332 1.1206 33.6931 15.1349 7.2091 20.3537 17.2884 4.8685 2.8263 3.8393 13.2014 23.6427 10.2289 3.7389 8.3951 26.6727 1.0919 102.5890 9.8667 255.6275 25.6312 1.4309 36.4937 17.0224 16.5542 57.8941 2.1883 32.5358 26.3626 35.6149 18.0807 19.2763 16.1433 5.8636 37.0567
temp: 298.150 k
press: 1.00000 atm
elementType: 8 8 8 6 6 6 6 6 6 6 6 6 6 6 1 1 1 1 1 1 1 1 1 1 1 1 1 1
symmnumber: 1
zpe: 595362.1 jmol-1
zpe.correction: 0.226761 hartree
zpe.thermalcorrener: 0.241058 hartree
zpe.thermalcorrenthalpy: 0.242002 hartree
zpe.thermalcorrgfe: 0.183225 hartree
zpe.sumelectzpe: -652.180228 hartree
zpe.sumelectthermal: -652.165931 hartree
zpe.sumelectthermalent: -652.164987 hartree
zpe.sumelectthermalfe: -652.223764 hartree
dipole: 0.5465 3.5502 -0.4741
dipole: 3.6232
quadrupole: -78.8730 -81.1109 -86.8635
quadrupole: 2.7938 7.4556 7.9420
quadrupole: 3.4095 1.1716 -4.5810 2.7938 7.4556 7.9420
hfenergy: -652.406989 hartree
pointgroup: C01 [X(C11H14O3)]
dipole: 0.1718467 1.3946807 -0.2393085 debye
polarizability: 164.6616194|1.8998233|132.2353047|10.5498681|2.9998289|82.0528072 unknown
InChI: InChI=1S/C11H14O3/c1-9(14-8-12)2-3-10-4-6-11(13)7-5-10/h4-9,13H,2-3H2,1H3
charge 0 multiplicity 1
28 atoms
O  -3.40603 -0.33625 -0.652514
O  4.997787 -0.520946 0.372921
O  -3.686043 -2.071732 0.905992
C  -1.422224 0.442142 0.636984
C  -0.550251 0.751883 -0.610607
C  -2.939803 0.621671 0.427663
C  0.921122 0.445361 -0.369753
C  -3.383003 2.007641 -0.046686
C  1.845559 1.471767 -0.056579
C  1.404294 -0.890093 -0.423211
C  3.206487 1.185654 0.196834
C  2.756356 -1.196287 -0.174868
C  3.658971 -0.153397 0.137493
C  -3.735238 -1.621627 -0.257177
H  -1.115782 1.102137 1.473263
H  -1.232676 -0.594195 0.974264
H  -0.665592 1.816669 -0.88706
H  -0.933598 0.155546 -1.460606
H  -3.465749 0.329826 1.356458
H  -2.961678 2.244095 -1.03805
H  -4.482501 2.060926 -0.118946
H  -3.043501 2.775906 0.671684
H  1.502146 2.512727 -0.013725
H  0.711457 -1.704122 -0.670474
H  3.905503 1.998945 0.433373
H  3.129966 -2.223529 -0.221313
H  -4.059532 -2.188283 -1.151518
H  5.548253 0.274362 0.58056
