program: Gaussian 09
title: 000239454
version: EM64L-G09RevD.01
frameworkgroup: C1[X(C15H14O4)]
method: RPBEPBE
basis: SDD
operation: Freq
keyword: #pfreq=noraman
keyword: PBEPBE/SDD
title: #p freq=noraman PBEPBE/SDD
converged: YES YES NO NO
title: Mulliken charges:
elementType: O O O O C C C C C C C C C C C C C C C H H H H H H H H H H H H H H
charge: -0.259639 -0.254198 -0.225880 -0.233103 0.465499 0.176070 0.402241 -0.231823 -0.470035 -0.340306 -0.448880 -0.243623 -0.435108 -0.264457 -0.241521 0.308462 0.312518 -0.754025 -0.754007 0.291370 0.247092 0.279659 0.240628 0.232041 0.237651 0.226637 0.228964 0.248052 0.251330 0.255447 0.254950 0.250854 0.247138
chargesum: 0.00000
title: Mulliken charges with hydrogens summed into heavy atoms:
elementType: O O O O C C C C C C C C C C C C C C C
charge: -0.259639 -0.254198 -0.225880 -0.233103 0.465499 0.176070 0.402241 0.059547 -0.222942 -0.060646 -0.208251 -0.011581 -0.197457 -0.037820 -0.012557 0.308462 0.312518 0.000803 -0.001065
polarizability: 2.09720703e+02 -7.11769367e+00 1.61200410e+02 -6.41559688e+00 4.24385340e+01 1.56737801e+02
1716.lowfreq: -10.6990 -7.4132 -0.0007 -0.0005 -0.0004 6.6021 24.5371 31.1485 36.5340
frequency: 24.4589 31.0924 36.4535 47.5977 56.0312 67.8564 78.5355 80.4365 129.7075 176.6919 179.3118 195.2470 222.8526 271.5961 286.9023 327.3234 394.3855 404.7558 455.2576 474.1353 488.9864 497.8422 539.3153 555.5914 562.8738 571.6821 592.6186 616.9740 639.6484 659.1059 723.0925 746.7533 786.9540 790.0391 811.3635 833.6328 854.5886 873.4070 888.2178 904.7542 927.0407 955.9176 965.6335 984.5599 988.5215 995.5545 1006.0434 1025.9094 1041.3647 1042.9380 1063.5609 1086.8200 1152.7560 1173.7476 1176.6575 1185.9949 1199.0528 1232.8177 1244.3693 1280.6865 1317.4899 1354.7413 1383.0159 1383.7868 1388.1207 1411.2224 1422.8971 1446.3712 1451.5362 1452.4676 1452.8484 1454.8174 1458.5680 1520.0821 1590.9699 1600.4437 1635.5690 1660.6798 1672.9332 3007.3516 3008.3042 3056.8294 3098.0059 3098.9247 3122.1913 3125.8648 3135.8689 3136.9856 3143.3902 3143.9866 3156.9204 3162.4038 3182.8170
redmass: 4.5296 3.8055 1.5741 4.1002 2.1537 3.4019 3.1414 1.4330 4.4864 4.4466 7.3591 4.9906 6.7361 4.4907 3.9525 5.3381 4.3658 3.3252 3.2556 3.2338 5.0524 6.6944 5.5862 3.1793 3.5957 3.4955 5.6709 5.2344 4.9697 3.8549 4.5073 1.3227 2.3732 4.4033 1.8576 2.7287 6.8989 6.1594 2.1050 5.1970 1.4679 3.7240 1.4058 1.9690 1.3755 1.3561 2.4900 2.7555 1.6704 1.6596 2.7698 2.4356 1.3936 2.1775 1.3321 1.2910 3.5847 1.5914 1.7721 1.6130 1.2186 2.0284 1.2609 1.2742 1.6281 3.7963 4.1521 2.2055 1.0580 1.0518 1.0578 1.0512 2.5625 3.9040 7.4017 5.2765 6.5740 9.6821 9.9670 1.0375 1.0373 1.0862 1.0961 1.0958 1.0864 1.0869 1.0907 1.0914 1.1017 1.1016 1.0976 1.0989 1.0957
irintensity: 0.8249 0.7039 0.9734 0.6417 3.0745 1.0143 1.9268 0.7823 0.7085 2.4633 6.4341 0.6648 6.8890 1.0361 1.5798 6.4417 1.5412 0.2559 32.5256 1.7592 8.4683 5.8790 3.9001 0.7873 8.4747 2.8587 4.6322 2.6302 9.0794 5.6970 8.9180 1.8249 49.4880 6.7051 91.2966 18.6778 186.8560 160.7686 4.2970 104.6979 10.4759 103.9277 18.1878 41.5758 1.9580 0.7732 133.1519 8.0478 8.2883 10.2239 30.4075 20.7945 6.0556 256.0895 71.8031 14.7089 372.9471 0.2756 16.4832 1.1403 6.9784 10.4086 60.8834 54.1072 5.1616 1.2488 0.3832 3.9033 25.4585 24.3776 14.7537 15.7429 2.4016 15.5310 3.4449 2.8730 0.6113 73.7029 291.9785 1.5181 1.0952 4.3902 5.8655 5.9281 0.5835 1.3763 10.4937 22.0881 9.4553 10.4842 36.2185 22.9870 7.9737
temp: 298.150 k
press: 1.00000 atm
elementType: 8 8 8 8 6 6 6 6 6 6 6 6 6 6 6 6 6 6 6 1 1 1 1 1 1 1 1 1 1 1 1 1 1
symmnumber: 1
zpe: 665401.4 jmol-1
zpe.correction: 0.253438 hartree
zpe.thermalcorrener: 0.271481 hartree
zpe.thermalcorrenthalpy: 0.272426 hartree
zpe.thermalcorrgfe: 0.204293 hartree
zpe.sumelectzpe: -879.555283 hartree
zpe.sumelectthermal: -879.537240 hartree
zpe.sumelectthermalent: -879.536296 hartree
zpe.sumelectthermalfe: -879.604428 hartree
dipole: -1.9358 2.3188 1.3218
dipole: 3.2971
quadrupole: -106.9964 -105.8477 -100.4002
quadrupole: 8.8204 6.6940 1.3490
quadrupole: -2.5816 -1.4329 4.0146 8.8204 6.6940 1.3490
hfenergy: -879.8087214 hartree
pointgroup: C01 [X(C15H14O4)]
dipole: -0.6159708 -1.0148965 -0.5227691 debye
polarizability: 205.4435262|17.5880164|162.2411613|-3.2672038|42.1886777|159.9742273 unknown
InChI: InChI=1S/C15H14O4/c1-10(16)18-15(19-11(2)17)14-9-5-7-12-6-3-4-8-13(12)14/h3-9,15H,1-2H3
charge 0 multiplicity 1
33 atoms
O  1.624871 -1.026169 0.481443
O  1.372649 0.79441 -0.974953
O  3.789553 -0.175904 0.763429
O  1.841575 2.94389 -0.176258
C  -0.362657 0.358902 0.760543
C  -1.33894 -0.417321 0.030577
C  -2.729639 -0.328613 0.433803
C  1.106839 0.347178 0.425772
C  -0.765775 1.182486 1.818399
C  -1.00135 -1.264404 -1.07826
C  -3.098722 0.519869 1.529879
C  -2.136269 1.265764 2.209239
C  -3.71805 -1.089299 -0.274816
C  -1.987948 -1.989686 -1.750409
C  -3.357895 -1.906078 -1.347278
C  3.02874 -1.155955 0.646746
C  1.792349 2.135199 -1.125275
C  3.40822 -2.617041 0.645723
C  2.157624 2.402442 -2.566307
H  1.691686 1.000281 1.097054
H  -0.018295 1.782728 2.34939
H  0.042227 -1.335638 -1.39281
H  -4.154195 0.575882 1.822189
H  -2.422261 1.91829 3.040483
H  -4.765546 -1.015016 0.041213
H  -1.713421 -2.630408 -2.595815
H  -4.119179 -2.482572 -1.884203
H  4.458262 -2.729117 0.951593
H  3.278231 -3.033106 -0.369459
H  2.748227 -3.186772 1.320488
H  3.131804 1.931439 -2.790542
H  1.409285 1.961088 -3.244465
H  2.2368 3.486254 -2.733916
