program: Gaussian 09
title: 000239453
version: EM64L-G09RevD.01
frameworkgroup: C1[X(C16H22O4)]
method: RPBEPBE
basis: SDD
operation: Freq
keyword: #pfreq=noraman
keyword: PBEPBE/SDD
title: #p freq=noraman PBEPBE/SDD
converged: YES YES NO NO
title: Mulliken charges:
elementType: O O O O C C C C C C C C C C C C C C C C H H H H H H H H H H H H H H H H H H H H H H
charge: -0.251976 -0.276947 -0.246915 -0.222050 -0.237205 0.553635 0.459069 -0.399800 -0.467299 -0.174814 -0.691928 -0.692232 -0.380368 -0.410456 0.317911 0.303673 -0.484779 -0.491532 -0.661543 -0.659914 0.209979 0.229977 0.235584 0.280135 0.228615 0.213202 0.211099 0.210639 0.213262 0.228304 0.255208 0.259600 0.243373 0.247659 0.246632 0.247210 0.224141 0.214831 0.237350 0.228204 0.217403 0.233059
chargesum: 0.00000
title: Mulliken charges with hydrogens summed into heavy atoms:
elementType: O O O O C C C C C C C C C C C C C C C C
charge: -0.251976 -0.276947 -0.246915 -0.222050 -0.027226 0.553635 0.459069 -0.169822 -0.231714 0.105321 -0.039011 -0.040027 -0.125160 -0.150856 0.317911 0.303673 0.006253 0.002310 0.014778 0.018752
polarizability: 2.41654104e+02 3.01637795e+00 1.74938241e+02 1.82890178e+00 1.73466959e+01 1.49313140e+02
1716.lowfreq: -0.0009 -0.0005 0.0003 2.1854 6.5285 8.7897 18.5669 21.4029 26.0313
frequency: 18.4885 21.3846 25.9827 36.9253 40.0642 50.5561 57.5222 60.4268 64.7255 95.0176 149.7097 158.4595 172.6449 188.9179 200.1072 214.2570 216.6026 227.5574 248.1905 269.6093 281.5827 292.9405 320.1547 337.8321 386.3429 405.9132 465.6861 496.1865 534.5090 538.9588 548.6088 561.6116 591.9278 628.4718 637.0166 651.3310 727.6325 754.0047 790.9480 793.2139 812.5426 829.5280 836.8551 854.9441 867.2186 889.4552 895.6110 921.1325 953.4758 969.3514 974.7045 981.8198 1007.7519 1014.2467 1021.4184 1052.3912 1059.0283 1080.3948 1085.7886 1086.6584 1108.6906 1113.7737 1118.4294 1130.9792 1156.5850 1194.0149 1218.5951 1222.9767 1243.1027 1244.3587 1293.5050 1307.8457 1314.8483 1318.5119 1339.7407 1343.3369 1358.0744 1378.8417 1390.8580 1398.0592 1398.5269 1401.3550 1417.6178 1442.3011 1442.9300 1467.3746 1468.3068 1471.7605 1472.7556 1480.1217 1481.4374 1482.1150 1484.5281 1510.4201 1585.1650 1624.4062 1648.4238 1667.9439 2974.8508 2977.5810 2981.1925 2995.7881 2996.6088 2999.5162 3000.9597 3046.4385 3051.4815 3051.8231 3067.7289 3074.8473 3078.3680 3082.6327 3095.4806 3098.4688 3103.8497 3105.1188 3121.2992 3127.2448 3146.7066 3163.5373
redmass: 3.0510 2.2844 3.0911 3.3454 2.4771 3.4818 3.5474 4.2306 5.5935 3.7302 4.1257 3.5373 2.0879 1.2354 1.5366 3.4955 1.3129 2.0052 1.4111 4.1762 3.9081 4.3560 4.2117 3.2337 4.3492 2.8631 3.2310 3.9619 3.1515 2.8855 3.3682 4.4531 2.9906 4.7687 5.5452 4.6056 3.4804 3.8072 1.3881 1.3553 3.9770 3.3988 4.8860 1.2505 2.3820 2.6187 4.2093 1.1815 1.4544 1.3805 5.5252 1.3743 2.2797 2.6106 2.0607 1.5483 2.6159 2.9284 1.6447 1.6562 2.3671 2.5847 1.6613 3.1678 1.7147 1.1296 1.7086 2.2188 1.1740 1.1767 1.5606 1.3205 1.2642 1.9007 1.6898 1.7042 1.4920 1.1929 3.1353 1.3733 1.2142 1.2109 2.3095 1.0831 1.0845 1.0441 1.0510 1.0393 1.0394 1.0494 1.0506 1.0515 1.0939 2.4925 6.6410 6.3154 9.5130 10.0221 1.0349 1.0354 1.0842 1.0598 1.0597 1.0392 1.0384 1.0976 1.0950 1.0878 1.1000 1.0992 1.1005 1.0997 1.1004 1.1004 1.1003 1.1002 1.0881 1.0882 1.0962 1.0953
irintensity: 0.0674 0.2083 0.0545 0.2970 0.1558 0.1823 3.1097 0.7854 3.9294 0.1338 0.7521 1.7516 0.0439 0.3448 1.1733 0.7869 0.0488 0.2479 0.3084 4.1028 1.7298 17.8002 18.1821 2.1788 2.2537 0.7740 1.8434 0.0538 2.2229 2.6412 15.9800 1.5472 27.4170 0.2835 0.6886 2.2295 2.3346 11.0664 13.2461 15.6435 21.2959 233.5028 58.6224 0.2379 34.2362 1.4790 76.4505 2.9308 0.0107 4.1070 94.0648 0.0968 159.9551 40.9616 70.9065 51.6902 176.9222 108.6097 3.3205 0.1546 126.5316 0.8116 38.8296 321.1457 0.1784 3.1514 15.8236 0.8191 0.1527 0.9834 20.4159 0.6260 20.6572 25.5132 53.7996 43.0445 8.7177 15.6572 0.2805 15.1458 14.9965 17.8813 7.9653 33.0639 23.7790 1.3771 4.5687 12.7362 13.2480 15.3136 15.0588 14.6022 10.3803 16.7205 0.6520 13.1740 97.9315 202.6469 30.8167 37.4366 17.6165 22.3361 22.7372 19.8765 18.9136 3.3479 3.9393 6.6190 0.3164 104.1998 24.0185 40.0426 31.3239 27.7715 29.4340 26.7473 13.5987 19.5628 8.9401 5.0530
temp: 298.150 k
press: 1.00000 atm
elementType: 8 8 8 8 6 6 6 6 6 6 6 6 6 6 6 6 6 6 6 6 1 1 1 1 1 1 1 1 1 1 1 1 1 1 1 1 1 1 1 1 1 1
symmnumber: 1
zpe: 908805.9 jmol-1
zpe.correction: 0.346146 hartree
zpe.thermalcorrener: 0.368697 hartree
zpe.thermalcorrenthalpy: 0.369642 hartree
zpe.thermalcorrgfe: 0.290067 hartree
zpe.sumelectzpe: -922.293943 hartree
zpe.sumelectthermal: -922.271391 hartree
zpe.sumelectthermalent: -922.270447 hartree
zpe.sumelectthermalfe: -922.350022 hartree
dipole: -1.5547 -1.4863 -2.4026
dipole: 3.2247
quadrupole: -110.0208 -111.1604 -120.0903
quadrupole: -4.1746 -9.1473 -1.3398
quadrupole: 3.7364 2.5967 -6.3331 -4.1746 -9.1473 -1.3398
hfenergy: -922.6400888 hartree
pointgroup: C01 [X(C16H22O4)]
dipole: -0.5069335 -0.5775865 -1.0094614 debye
polarizability: 238.1185422|15.6282496|174.1329931|-1.176456|19.9710078|153.6539494 unknown
InChI: InChI=1S/C16H22O4/c1-5-14(17)19-16(20-15(18)6-2)13-9-7-12(8-10-13)11(3)4/h7-11,16H,5-6H2,1-4H3
charge 0 multiplicity 1
42 atoms
O  1.305509 1.229344 -0.511312
O  1.700746 -1.07587 -0.367967
O  1.253166 2.497643 1.453281
O  3.665979 -0.336859 0.669222
C  -4.844758 -0.983206 0.060447
C  -3.333743 -0.743134 0.110163
C  -0.516091 -0.290464 0.213394
C  -2.478564 -1.212385 -0.923496
C  -2.746598 -0.043231 1.193999
C  0.960026 0.000992 0.282351
C  -5.491744 -0.288045 -1.167725
C  -5.18523 -2.497522 0.080054
C  -1.088454 -0.990209 -0.877268
C  -1.353793 0.182262 1.250502
C  1.491095 2.413103 0.228933
C  3.094895 -1.126547 -0.107316
C  2.004543 3.517667 -0.678175
C  3.722405 -2.253145 -0.906115
C  1.953745 4.905593 -0.014865
C  5.200008 -2.48893 -0.547163
H  -5.283881 -0.52951 0.971915
H  -2.903699 -1.75892 -1.773831
H  -3.386909 0.327377 2.003691
H  1.326788 0.167497 1.311175
H  -5.285025 0.797185 -1.167847
H  -6.587972 -0.433778 -1.162267
H  -5.100208 -0.706878 -2.113445
H  -4.78942 -3.00681 -0.818335
H  -6.280731 -2.647387 0.097087
H  -4.753037 -2.993388 0.967697
H  -0.437925 -1.363883 -1.673968
H  -0.916899 0.73717 2.08889
H  1.424671 3.489507 -1.618945
H  3.044045 3.252669 -0.95623
H  3.609074 -1.998916 -1.978498
H  3.113377 -3.163429 -0.751028
H  0.915455 5.195507 0.222303
H  2.382624 5.667745 -0.688949
H  2.522834 4.910366 0.929912
H  5.310637 -2.779037 0.511764
H  5.621884 -3.293181 -1.174823
H  5.795574 -1.573469 -0.702408
