program: Gaussian 09
title: 000239450
version: EM64L-G09RevD.01
frameworkgroup: C1[X(C11H21ClO2)]
method: RPBEPBE
basis: SDD
operation: Freq
keyword: #p
keyword: freq=noraman
keyword: PBEPBE/SDD
title: #p freq=noraman PBEPBE/SDD
converged: YES YES NO NO
title: Mulliken charges:
elementType: Cl O O C C C C C C C C C C C H H H H H H H H H H H H H H H H H H H H H
charge: -0.050050 -0.281482 -0.262902 0.337162 -0.422634 -0.384916 -0.017476 -0.372152 -0.368630 -0.732149 -0.357752 -0.595203 -0.355668 -0.696713 0.220795 0.207764 0.195671 0.234283 0.251456 0.228943 0.211709 0.187453 0.194509 0.243123 0.222013 0.222421 0.194334 0.186908 0.276793 0.257056 0.196219 0.193884 0.214788 0.211363 0.209080
chargesum: 0.00000
title: Mulliken charges with hydrogens summed into heavy atoms:
elementType: Cl O O C C C C C C C C C C C
charge: -0.050050 -0.281482 -0.262902 0.337162 0.005924 0.045038 0.233980 0.068500 0.013333 -0.044592 0.023490 -0.061355 0.034435 -0.061481
polarizability: 1.55083782e+02 5.03804211e+00 1.32855919e+02 -4.12280075e+00 -1.96721701e+00 1.09375948e+02
1716.lowfreq: -7.2506 -0.0023 -0.0016 -0.0014 6.1390 11.5053 19.2517 41.2804 56.7363
frequency: 19.0685 41.1920 56.6858 62.3123 85.4087 96.0195 108.0103 128.0317 146.5838 174.5802 197.5460 209.2135 225.4113 228.1365 290.4617 325.4380 332.7329 349.1764 419.0910 423.0064 462.1778 499.6272 636.9586 654.4717 705.6528 727.5514 741.7009 749.2191 771.2654 797.5194 830.6795 877.8346 888.6453 894.4287 936.7317 955.0027 967.9307 981.2583 997.8557 1013.0222 1034.7446 1037.8215 1067.4014 1081.4871 1087.3177 1106.4898 1125.6625 1157.7698 1178.9293 1195.3663 1209.7626 1228.6089 1233.8380 1242.0223 1259.2915 1276.3755 1284.6634 1287.1639 1290.9423 1301.4136 1322.6452 1332.7650 1351.3761 1354.4349 1360.5250 1385.9407 1389.6002 1434.2375 1447.4650 1462.0898 1465.4969 1466.3762 1467.1536 1475.7482 1476.0820 1477.2281 1484.2225 1490.0766 2950.5250 2955.0450 2966.6565 2971.6424 2975.5466 2986.0397 2987.7980 2989.6555 2997.6774 3004.1482 3026.2750 3037.4058 3047.4083 3051.9685 3060.9583 3068.0265 3070.5325 3088.2429 3096.8878 3104.5273 3136.9601
redmass: 7.7197 4.0783 3.6413 1.5377 3.2926 2.9097 3.9326 1.7647 2.1535 3.0342 2.9872 1.3995 1.1708 2.5912 3.3230 2.5556 3.0853 2.8332 2.8978 3.0883 3.4556 3.4653 3.8526 4.3853 5.5924 1.0671 1.1540 4.8824 1.8931 1.5454 2.9264 1.2889 1.8986 2.4181 2.1449 2.1753 1.4850 2.1631 2.4893 3.0062 3.3304 1.4859 2.5254 2.1750 2.0180 1.9088 2.6134 1.2175 2.0399 1.3937 1.5469 1.7507 1.3267 1.5598 1.4927 1.2679 1.0578 1.3964 1.2011 1.1474 1.2933 1.4377 1.2843 1.6251 1.6165 1.2491 1.2182 1.1030 1.0668 1.0761 1.0703 1.0579 1.0752 1.0616 1.0486 1.0773 1.0822 1.0943 1.0591 1.0592 1.0595 1.0366 1.0618 1.0643 1.0781 1.0776 1.0365 1.0999 1.1015 1.1020 1.0578 1.0870 1.1036 1.1006 1.0993 1.1001 1.1002 1.0995 1.1091
irintensity: 0.5820 0.2121 2.0392 0.0511 0.9299 4.6607 1.9366 0.0974 0.2338 0.7206 0.5421 1.3918 0.1218 0.9432 1.0443 0.7513 4.4400 3.0597 1.6090 5.7133 8.4704 17.2695 11.0951 14.5614 20.3100 13.3880 1.5745 3.3677 8.7927 12.4541 35.8863 0.4230 4.5540 1.6417 1.6458 39.7594 4.6943 8.4513 19.6446 33.2140 39.3923 35.8630 2.1227 0.3340 17.9946 11.4780 19.7853 36.6003 19.7177 12.6407 12.4449 41.3728 10.7371 17.6556 16.1913 15.2502 1.6726 11.4740 5.5295 12.7458 4.2383 3.3603 3.4827 4.0908 1.3726 39.1042 10.6310 10.0559 3.7469 6.3811 1.5602 9.6927 0.2082 4.3302 9.6494 10.8867 0.9625 24.4609 3.0554 10.7753 69.6364 35.9207 36.3768 48.5191 15.3441 34.2520 14.7137 1.9882 24.8696 19.1505 16.3544 31.4520 59.4972 107.5516 56.8217 27.4288 33.1727 16.2245 15.7155
temp: 298.150 k
press: 1.00000 atm
elementType: 17 8 8 6 6 6 6 6 6 6 6 6 6 6 1 1 1 1 1 1 1 1 1 1 1 1 1 1 1 1 1 1 1 1 1
symmnumber: 1
zpe: 794990.9 jmol-1
zpe.correction: 0.302796 hartree
zpe.thermalcorrener: 0.319775 hartree
zpe.thermalcorrenthalpy: 0.320719 hartree
zpe.thermalcorrgfe: 0.256000 hartree
zpe.sumelectzpe: -1041.107976 hartree
zpe.sumelectthermal: -1041.090997 hartree
zpe.sumelectthermalent: -1041.090052 hartree
zpe.sumelectthermalfe: -1041.154772 hartree
dipole: -1.6153 -1.7980 0.6095
dipole: 2.4927
quadrupole: -80.8433 -100.2921 -96.4297
quadrupole: 0.7822 -0.5385 5.0069
quadrupole: 11.6784 -7.7704 -3.9080 0.7822 -0.5385 5.0069
hfenergy: -1041.4107718 hartree
pointgroup: C01 [X(C11H21Cl1O2)]
dipole: -0.6238611 0.7540783 -0.0629148 debye
polarizability: 154.5332365|-6.5198783|132.1926516|4.9421516|4.3526032|110.5897597 unknown
InChI: InChI=1S/C11H21ClO2/c1-3-4-5-6-7-11(2)13-9-10(8-12)14-11/h10H,3-9H2,1-2H3
charge 0 multiplicity 1
35 atoms
Cl -2.093513 -3.126316 -0.818647
O  -1.715422 -0.282516 0.650556
O  -2.268041 1.595275 -0.691906
C  -1.255881 1.099408 0.276594
C  0.08437 1.026004 -0.46871
C  1.234395 0.41562 0.361819
C  -2.990795 -0.565292 -0.03738
C  -3.506491 0.84934 -0.412128
C  2.522927 0.237161 -0.471589
C  -1.250051 1.950649 1.551056
C  3.691053 -0.367749 0.338996
C  -2.802965 -1.444009 -1.27729
C  4.980365 -0.550854 -0.493699
C  6.141202 -1.165073 0.318027
H  0.349648 2.049236 -0.8006
H  -0.075506 0.41974 -1.380431
H  1.458366 1.0597 1.236163
H  0.906546 -0.564674 0.758391
H  -3.64393 -1.074579 0.69255
H  -4.119685 0.887801 -1.326999
H  -4.06545 1.29417 0.43466
H  2.835025 1.218583 -0.887628
H  2.307205 -0.415985 -1.342931
H  -0.638599 1.465624 2.330044
H  -0.83646 2.95262 1.342337
H  -2.275298 2.063923 1.943268
H  3.37977 -1.349629 0.752439
H  3.909568 0.281906 1.212702
H  -2.100233 -0.996898 -1.995875
H  -3.769948 -1.662611 -1.758637
H  4.758625 -1.195139 -1.369117
H  5.292544 0.431957 -0.902947
H  7.049335 -1.287353 -0.300761
H  5.864374 -2.160953 0.712732
H  6.404251 -0.52479 1.181437
