program: Gaussian 09
title: 000239448
version: EM64L-G09RevD.01
frameworkgroup: C1[X(C11H13ClO2)]
method: RPBEPBE
basis: SDD
operation: Freq
keyword: #p
keyword: freq=noraman
keyword: PBEPBE/SDD
title: #p freq=noraman PBEPBE/SDD
converged: YES YES NO NO
title: Mulliken charges:
elementType: Cl O O C C C C C C C C C C C H H H H H H H H H H H H H
charge: -0.045495 -0.270037 -0.257788 0.032676 0.043301 -0.319552 -0.571199 -0.652435 0.468797 -0.447484 -0.380668 -0.218448 -0.225580 -0.246130 0.218296 0.246611 0.220251 0.214290 0.227394 0.239041 0.278199 0.260302 0.230574 0.277080 0.224658 0.225898 0.227447
chargesum: 0.00000
title: Mulliken charges with hydrogens summed into heavy atoms:
elementType: Cl O O C C C C C C C C C C C
charge: -0.045495 -0.270037 -0.257788 0.250972 0.289912 0.114989 -0.104763 -0.113934 0.468797 -0.216910 -0.103588 0.006210 0.000318 -0.018683
polarizability: 1.61906221e+02 3.99614377e+00 1.43402736e+02 -8.04692457e+00 -5.18694835e+00 7.59151195e+01
1716.lowfreq: -6.4050 -3.2990 -0.0015 -0.0006 0.0008 5.6128 22.2112 30.3156 37.0616
frequency: 22.0020 30.1160 36.9507 75.7483 94.7165 121.2508 174.5836 238.2357 258.4126 291.4641 321.9918 405.4245 422.1390 437.9797 516.5763 575.7023 616.9214 642.4300 670.4235 685.6347 707.2329 753.3872 772.9672 804.3325 853.0685 858.8011 887.3988 902.0902 926.2046 961.2738 981.0259 990.4180 995.6505 999.2488 1007.2570 1020.8137 1028.6440 1085.8116 1106.3650 1121.3250 1150.5014 1171.7944 1192.1272 1198.7582 1210.5683 1217.4661 1261.5987 1265.9129 1292.1030 1310.1805 1323.1228 1338.0330 1356.5635 1381.8972 1388.8057 1429.6126 1439.5482 1450.5406 1481.6701 1485.7696 1592.3435 1615.6877 2947.3838 2991.2996 2999.7771 3005.7382 3054.9511 3061.6716 3070.1928 3115.3046 3125.2956 3138.3386 3142.7684 3150.8913 3163.4244
redmass: 4.1626 3.5607 8.8080 5.1046 4.4562 4.0789 3.0694 4.4923 5.5467 3.3114 5.1544 2.8310 2.5325 2.4484 3.1086 5.3373 6.1371 4.7214 7.3766 5.6578 1.8785 1.7051 2.9399 4.3424 3.5340 1.2539 1.7173 2.8677 1.6397 4.7084 1.4000 5.0998 2.1636 2.0721 2.5386 2.0556 2.2312 1.5981 2.3013 2.1830 1.0921 1.0559 1.1350 1.2747 1.7575 1.5686 1.1677 1.1421 1.3484 1.2312 1.3191 1.2655 1.4705 5.3269 1.6427 1.1102 1.7615 1.2397 1.0867 2.2888 6.0196 6.0146 1.0851 1.0760 1.0664 1.0611 1.0667 1.0989 1.1000 1.0865 1.0870 1.0924 1.1102 1.0956 1.1012
irintensity: 1.2575 3.7479 1.0875 2.1143 1.6087 3.2898 0.9089 3.5810 2.2726 2.7050 5.7168 0.2203 9.5016 1.7882 25.7385 8.7067 0.9126 4.9036 9.8582 34.6392 49.7582 55.3320 17.0608 5.1143 48.3328 0.6381 3.9043 22.0810 9.3855 47.1626 0.7497 1.3961 52.8326 5.5014 72.4038 13.1861 6.4690 15.4457 32.8306 23.5413 1.1855 0.2956 1.9083 2.4419 3.6189 1.1580 4.0326 9.3532 8.9246 2.6944 4.4329 1.2015 17.0376 0.8805 29.1647 10.5654 4.5944 17.6526 2.7551 24.5733 0.7944 8.1358 61.0604 18.8736 74.7967 16.2542 14.5668 39.0921 11.8591 7.1798 1.7796 28.3572 8.8782 22.1529 21.4840
temp: 298.150 k
press: 1.00000 atm
elementType: 17 8 8 6 6 6 6 6 6 6 6 6 6 6 1 1 1 1 1 1 1 1 1 1 1 1 1
symmnumber: 1
zpe: 567769.6 jmol-1
zpe.correction: 0.216252 hartree
zpe.thermalcorrener: 0.229388 hartree
zpe.thermalcorrenthalpy: 0.230332 hartree
zpe.thermalcorrgfe: 0.173223 hartree
zpe.sumelectzpe: -1036.404657 hartree
zpe.sumelectthermal: -1036.391520 hartree
zpe.sumelectthermalent: -1036.390576 hartree
zpe.sumelectthermalfe: -1036.447685 hartree
dipole: -1.1962 -1.8999 -0.8705
dipole: 2.4079
quadrupole: -76.9167 -93.4601 -90.1365
quadrupole: 7.9871 -0.5712 0.5296
quadrupole: 9.9210 -6.6223 -3.2987 7.9871 -0.5712 0.5296
hfenergy: -1036.6209087 hartree
pointgroup: C01 [X(C11H13Cl1O2)]
dipole: -0.6030369 0.6403365 0.3518407 debye
polarizability: 161.7834733|-1.2400556|142.8208521|12.4674562|-0.2268893|76.6197511 unknown
InChI: InChI=1S/C11H13ClO2/c12-7-10-8-13-11(14-10)6-9-4-2-1-3-5-9/h1-5,10-11H,6-8H2
charge 0 multiplicity 1
27 atoms
Cl -3.384907 -2.905948 -0.412249
O  -1.419744 -0.281506 -0.26107
O  -1.871126 1.996505 -0.044164
C  -0.81519 0.982436 0.178778
C  -2.810793 -0.222043 0.234985
C  -3.161573 1.307475 0.168205
C  0.406432 1.327501 -0.667018
C  -3.700633 -1.065721 -0.660697
C  1.654911 0.526387 -0.312603
C  2.861994 1.193459 0.016493
C  1.640954 -0.894048 -0.321822
C  4.033004 0.463802 0.326329
C  2.809473 -1.623852 -0.010937
C  4.010181 -0.949254 0.313154
H  -0.585323 0.92723 1.266484
H  -2.849082 -0.585808 1.281405
H  -3.813233 1.561081 -0.687536
H  -3.631157 1.649528 1.108953
H  0.597196 2.407232 -0.531114
H  0.118665 1.175087 -1.724477
H  -3.501369 -0.85938 -1.722637
H  -4.765045 -0.921179 -0.419751
H  2.886344 2.290454 0.027984
H  0.711081 -1.418583 -0.56679
H  4.957749 0.996288 0.576544
H  2.783962 -2.719585 -0.022195
H  4.916028 -1.51786 0.552245
