program: Gaussian 09
title: 000239447
version: EM64L-G09RevD.01
frameworkgroup: C1[X(C10H17ClO2)]
method: RPBEPBE
basis: SDD
operation: Freq
keyword: #p
keyword: freq=noraman
keyword: PBEPBE/SDD
title: #p freq=noraman PBEPBE/SDD
converged: NO YES NO NO
title: Mulliken charges:
elementType: Cl O O C C C C C C C C C C H H H H H H H H H H H H H H H H H
charge: -0.051216 -0.290559 -0.273401 0.361292 -0.461681 -0.472913 0.009364 -0.411877 -0.416120 -0.015281 -0.373384 -0.744229 -0.597085 0.205288 0.214715 0.215775 0.211221 0.190371 0.194582 0.218870 0.224409 0.196320 0.250406 0.227387 0.213357 0.213435 0.212344 0.213954 0.277795 0.256864
chargesum: 0.00000
title: Mulliken charges with hydrogens summed into heavy atoms:
elementType: Cl O O C C C C C C C C C C
charge: -0.051216 -0.290559 -0.273401 0.361292 -0.041679 -0.045917 0.199735 0.001575 0.004609 0.235125 0.067359 -0.104497 -0.062427
polarizability: 1.32963877e+02 4.50267276e+00 1.20682839e+02 -5.08450136e-01 -7.66651825e-02 9.81953800e+01
1716.lowfreq: -42.8030 -13.4798 -10.6222 0.0009 0.0019 0.0027 23.8221 54.1965 77.7389
frequency: 21.1870 53.6596 76.9487 97.7116 166.7910 185.1628 197.5104 209.7280 260.5555 291.4550 307.4033 331.1956 378.9736 405.0809 429.4424 456.3900 462.9609 540.1171 617.8551 652.3068 701.8070 743.3050 766.3279 775.2388 820.7071 845.8514 889.9216 895.3247 928.0412 930.5113 954.9856 960.9454 975.2948 988.6814 1011.3630 1024.7915 1067.9235 1081.5639 1093.2214 1105.3168 1143.0356 1150.2831 1162.3278 1189.0601 1198.7200 1232.7174 1247.4630 1258.1306 1271.0297 1277.7010 1298.2476 1303.8578 1322.5988 1324.4945 1338.7082 1340.4397 1353.0854 1363.2424 1386.7784 1433.7237 1445.8524 1455.4856 1459.8409 1467.5837 1473.4381 1473.8959 1478.0476 2939.0522 2966.6230 2978.4887 2983.0048 2987.7569 2991.9809 2996.1101 3036.1607 3042.3890 3047.7427 3049.1735 3054.2184 3062.7294 3064.8671 3066.7949 3088.5582 3137.7789
redmass: 5.7961 3.9695 3.5682 4.0023 2.1339 2.7760 1.1974 2.9217 3.5483 2.3461 3.2638 3.0144 2.6191 2.2000 2.2030 3.1547 3.5127 3.2884 2.9980 4.7979 8.5147 4.1933 2.7016 1.5174 2.4077 2.7270 2.0645 2.1570 2.1500 1.4218 2.3923 1.5216 2.9963 2.1699 1.6172 3.0756 2.2907 1.3072 2.7005 1.9110 1.7012 1.7373 1.4443 2.0396 1.3274 1.3393 1.4187 1.3500 1.5461 1.3186 1.3769 1.2548 1.3333 1.5101 1.4781 1.5659 1.2735 1.5602 1.2203 1.1045 1.0895 1.0850 1.0967 1.0778 1.0592 1.0845 1.0568 1.0826 1.0360 1.0588 1.0595 1.0617 1.0643 1.0632 1.1012 1.1010 1.0579 1.0870 1.1024 1.0993 1.0993 1.1010 1.1011 1.1093
irintensity: 1.2617 0.3690 5.8656 0.9289 1.2848 0.3033 0.1603 0.1301 3.5553 0.7821 0.3194 5.5217 4.1038 3.3300 1.7821 15.1620 1.0536 3.4470 10.5520 21.3032 16.1408 5.5257 3.3167 1.0677 7.3455 63.6131 1.4934 3.8176 10.5368 6.3005 34.2481 11.8665 2.4376 10.8857 17.8562 38.8881 124.2017 2.5480 12.3020 22.4480 9.0489 33.8793 0.2786 3.7520 7.8996 5.8582 21.0088 13.4148 5.3067 11.5590 0.3873 5.3653 8.0969 4.8975 0.1438 3.4395 6.8680 19.9873 8.6235 9.4273 12.5890 5.7846 16.4145 6.0468 10.2104 12.6029 9.3382 25.4542 31.5081 33.2230 55.5150 7.7485 60.2836 17.1562 41.2675 14.1025 16.7166 27.6424 26.5289 33.0733 48.7376 87.5999 26.2510 14.9291
temp: 298.150 k
press: 1.00000 atm
elementType: 17 8 8 6 6 6 6 6 6 6 6 6 6 1 1 1 1 1 1 1 1 1 1 1 1 1 1 1 1 1
symmnumber: 1
zpe: 670188.6 jmol-1
zpe.correction: 0.255261 hartree
zpe.thermalcorrener: 0.268614 hartree
zpe.thermalcorrenthalpy: 0.269559 hartree
zpe.thermalcorrgfe: 0.214223 hartree
zpe.sumelectzpe: -1000.716544 hartree
zpe.sumelectthermal: -1000.703191 hartree
zpe.sumelectthermalent: -1000.702247 hartree
zpe.sumelectthermalfe: -1000.757582 hartree
dipole: -0.0623 2.5162 -0.1911
dipole: 2.5243
quadrupole: -80.8177 -90.2765 -85.9891
quadrupole: 8.3125 -0.6612 -4.8386
quadrupole: 4.8768 -4.5821 -0.2947 8.3125 -0.6612 -4.8386
hfenergy: -1000.9718055 hartree
pointgroup: C01 [X(C10H17Cl1O2)]
dipole: -0.1380935 -0.8351716 -0.5193339 debye
polarizability: 133.7620677|3.6371045|115.0545468|-1.7578539|8.6724661|103.0254822 unknown
InChI: InChI=1S/C10H17ClO2/c1-8-2-4-10(5-3-8)12-7-9(6-11)13-10/h8-9H,2-7H2,1H3
charge 0 multiplicity 1
30 atoms
Cl -2.970413 2.26169 1.420264
O  -0.82652 0.504801 -0.207006
O  -0.998629 -1.83595 0.137958
C  -0.010916 -0.74198 0.010501
C  0.908634 -0.940264 -1.206735
C  0.769314 -0.630609 1.324539
C  2.798679 0.272261 0.032182
C  1.977525 0.176197 -1.279869
C  1.843218 0.478977 1.236635
C  -2.25248 0.13056 -0.2894
C  -2.202362 -1.392031 -0.58544
C  3.855862 1.393714 -0.046582
C  -3.001811 0.422748 1.013223
H  0.299938 -0.962763 -2.12971
H  1.39818 -1.928322 -1.100676
H  1.243302 -1.611736 1.523599
H  0.058658 -0.428103 2.145474
H  3.324915 -0.697894 0.176594
H  2.651511 -0.00974 -2.138586
H  1.47311 1.146043 -1.461165
H  1.337512 1.459246 1.131634
H  2.422625 0.508647 2.179552
H  -2.693259 0.709376 -1.119979
H  -3.052086 -1.964183 -0.179184
H  -2.111755 -1.575198 -1.673799
H  4.454273 1.448799 0.882082
H  4.552433 1.231706 -0.89058
H  3.370789 2.377842 -0.19371
H  -2.545735 -0.091867 1.871739
H  -4.070211 0.167833 0.924046
