program: Gaussian 09
title: 000239441
version: EM64L-G09RevD.01
frameworkgroup: C1[X(C16H18O2)]
method: RPBEPBE
basis: SDD
operation: Freq
keyword: #pfreq=noraman
keyword: PBEPBE/SDD
title: #p freq=noraman PBEPBE/SDD
converged: YES YES NO NO
title: Mulliken charges:
elementType: O O C C C C C C C C C C C C C C C C H H H H H H H H H H H H H H H H H H
charge: -0.263015 -0.228845 0.369994 0.185636 -0.703503 -0.344247 0.401137 -0.349103 -0.306789 -0.414680 -0.384795 -0.450575 0.280918 -0.244290 -0.430729 -0.686808 -0.267117 -0.243500 0.248453 0.246554 0.204367 0.231833 0.202141 0.191457 0.229295 0.219750 0.237385 0.265411 0.238546 0.227631 0.237057 0.217041 0.211309 0.217271 0.226826 0.227985
chargesum: 0.00000
title: Mulliken charges with hydrogens summed into heavy atoms:
elementType: O O C C C C C C C C C C C C C C C C
charge: -0.263015 -0.228845 0.369994 0.185636 -0.208496 0.091953 0.401137 0.044495 0.142256 -0.177295 -0.119384 -0.212029 0.280918 -0.016659 -0.193672 -0.041187 -0.040291 -0.015515
polarizability: 1.81997478e+02 2.95541737e-01 2.06895274e+02 3.48342719e+01 -2.06963649e+01 1.41593739e+02
1716.lowfreq: -9.1147 -2.9238 -2.0144 -0.0007 -0.0006 0.0003 12.9648 21.5529 41.2172
frequency: 9.2068 20.6131 40.9672 53.5647 70.9471 80.3333 106.8093 146.5985 177.9944 192.7363 218.2609 226.8116 259.5016 286.3315 323.9362 398.1874 417.0821 426.4652 459.8160 470.8017 478.0103 507.2088 538.9281 557.8828 621.8009 635.7032 687.0988 734.3735 741.9567 746.8377 782.2574 785.2729 798.0646 810.9731 822.6007 861.4101 886.2204 899.2283 916.9741 929.6926 946.4778 950.2553 964.5740 985.5156 993.4837 1020.5818 1031.9116 1041.9838 1075.1672 1076.8628 1100.9263 1118.0634 1150.6419 1162.3743 1174.3970 1182.4124 1219.4182 1226.1849 1240.1947 1252.3442 1272.2319 1278.0897 1285.4683 1290.5010 1295.6446 1343.8525 1368.2396 1380.6900 1391.8279 1405.9261 1419.3317 1443.7542 1452.2044 1455.6816 1467.9774 1469.6928 1475.8865 1476.6175 1487.7257 1519.0840 1588.9240 1599.7840 1634.1560 1642.9487 2968.1935 2976.6162 2992.8712 3013.5666 3020.0969 3028.0789 3052.9633 3074.2092 3076.6767 3092.6711 3101.3776 3119.9985 3123.1028 3132.6023 3134.4158 3152.4573 3158.5023 3166.5138
redmass: 3.6933 4.5738 1.9876 4.9672 3.1351 5.0429 2.3884 4.2772 4.0519 4.1830 1.6223 2.0300 4.3416 3.1225 3.3761 3.0372 3.4073 3.6015 2.7351 3.5150 4.8100 6.4024 4.5472 4.4774 4.8735 3.5421 4.5698 2.5556 1.0987 1.5109 2.3634 4.7508 1.4671 1.6634 2.3383 2.8010 2.1615 1.7979 1.7544 1.7946 1.5521 2.9575 1.3858 1.3668 1.3455 3.4761 3.7181 2.3884 2.4248 2.5318 2.0904 2.3874 1.4554 1.7383 1.1746 1.1836 1.5426 1.3404 1.8062 1.8334 1.2798 1.5964 1.1671 1.0681 1.6053 1.4243 1.4009 2.0456 1.2138 3.0782 5.1863 2.2024 1.0998 2.4637 1.1446 1.0710 1.0522 1.0528 1.0847 3.6425 7.5490 5.2845 6.4253 9.3416 1.0586 1.0366 1.0606 1.0999 1.0581 1.0589 1.1028 1.1009 1.0998 1.1029 1.1081 1.0863 1.0861 1.0897 1.0917 1.0952 1.0992 1.0986
irintensity: 0.2587 0.3444 0.0945 1.0016 0.2192 0.9329 0.4510 0.9378 2.2495 1.2027 1.4523 0.8393 3.9761 8.5667 1.2013 2.6333 4.9282 0.6906 8.9526 2.0769 8.4348 0.9019 9.9588 5.8197 5.2063 0.3514 1.0704 4.6438 10.6022 4.2032 21.7226 4.3983 78.5088 23.4641 24.9415 0.5468 4.9517 9.3826 2.8475 15.4231 0.3741 44.3373 3.9057 2.6562 0.3991 8.3781 12.8284 25.2989 3.7032 19.1262 188.4759 6.5751 4.1611 5.6618 2.1048 0.6827 89.6921 11.9073 7.3489 14.0458 9.9043 3.5127 1.9193 1.6136 41.5707 2.9191 1.5334 15.3281 9.6592 4.1092 2.6946 6.9058 10.7818 0.4151 17.9359 0.8949 9.1573 8.5816 19.9312 8.7667 2.6015 7.0269 0.6110 155.2986 34.1335 27.0507 20.1267 10.1919 57.8924 15.1603 4.3195 57.2836 53.1550 4.2586 31.7326 0.7220 0.3083 10.8935 24.7409 26.9198 32.4540 16.2972
temp: 298.150 k
press: 1.00000 atm
elementType: 8 8 6 6 6 6 6 6 6 6 6 6 6 6 6 6 6 6 1 1 1 1 1 1 1 1 1 1 1 1 1 1 1 1 1 1
symmnumber: 1
zpe: 782802.7 jmol-1
zpe.correction: 0.298154 hartree
zpe.thermalcorrener: 0.315258 hartree
zpe.thermalcorrenthalpy: 0.316202 hartree
zpe.thermalcorrgfe: 0.249818 hartree
zpe.sumelectzpe: -769.655412 hartree
zpe.sumelectthermal: -769.638308 hartree
zpe.sumelectthermalent: -769.637364 hartree
zpe.sumelectthermalfe: -769.703748 hartree
dipole: -0.5100 1.3784 -0.9099
dipole: 1.7286
quadrupole: -96.4516 -102.1044 -106.8393
quadrupole: -2.6621 7.8741 2.1185
quadrupole: 5.3468 -0.3060 -5.0409 -2.6621 7.8741 2.1185
hfenergy: -769.9535661 hartree
pointgroup: C01 [X(C16H18O2)]
dipole: 0.2037708 -0.5098433 -0.4012921 debye
polarizability: 185.6078475|3.0798871|201.7616784|-31.6846973|28.230347|143.1169654 unknown
InChI: InChI=1S/C16H18O2/c1-2-3-11-18-16(17)12-14-9-6-8-13-7-4-5-10-15(13)14/h4-10H,2-3,11-12H2,1H3
charge 0 multiplicity 1
36 atoms
O  2.315828 1.246049 -1.199726
O  1.887384 2.440298 0.76087
C  -0.975858 1.50477 -0.291303
C  -1.227705 0.111496 -0.587894
C  0.143852 2.276677 -0.98892
C  3.580105 -0.39638 0.195726
C  -2.314842 -0.565819 0.096526
C  4.979187 -0.853005 0.673966
C  3.664872 0.866329 -0.671637
C  -1.769958 2.161826 0.656499
C  -0.447648 -0.638462 -1.533201
C  -3.102528 0.149855 1.057345
C  1.512208 2.019551 -0.355582
C  -2.832048 1.489183 1.33552
C  -2.582551 -1.943533 -0.2002
C  4.91161 -2.127063 1.543691
C  -0.735432 -1.979276 -1.801868
C  -1.812893 -2.640397 -1.132976
H  0.195987 2.036329 -2.063241
H  -0.051752 3.358086 -0.886417
H  3.099743 -1.208056 -0.384623
H  2.936647 -0.193203 1.072193
H  5.455434 -0.036057 1.252969
H  5.630324 -1.037964 -0.204811
H  4.069596 1.718577 -0.095864
H  4.26415 0.700905 -1.582326
H  -1.569199 3.214437 0.885998
H  0.39619 -0.158743 -2.038153
H  -3.919181 -0.372995 1.569421
H  -3.432263 2.0352 2.071213
H  -3.408227 -2.442286 0.321719
H  4.289652 -1.958473 2.442315
H  4.466766 -2.968823 0.980665
H  5.91733 -2.437946 1.880519
H  -0.130026 -2.532392 -2.52874
H  -2.027656 -3.691793 -1.353773
