program: Gaussian 09
title: 000239440
version: EM64L-G09RevD.01
frameworkgroup: C1[X(C15H16O2)]
method: RPBEPBE
basis: SDD
operation: Freq
keyword: #pfreq=noraman
keyword: PBEPBE/SDD
title: #p freq=noraman PBEPBE/SDD
converged: YES YES NO NO
title: Mulliken charges:
elementType: O O C C C C C C C C C C C C C C C H H H H H H H H H H H H H H H H
charge: -0.283196 -0.230879 0.393395 0.180431 -0.705114 0.401528 -0.422865 0.036115 -0.391230 -0.452132 0.285247 -0.243513 -0.430722 -0.265350 -0.244272 -0.681996 -0.685845 0.243284 0.249839 0.234912 0.236860 0.267648 0.238392 0.227392 0.236956 0.225943 0.213791 0.252196 0.219238 0.210274 0.233940 0.221904 0.227828
chargesum: 0.00000
title: Mulliken charges with hydrogens summed into heavy atoms:
elementType: O O C C C C C C C C C C C C C C C
charge: -0.283196 -0.230879 0.393395 0.180431 -0.211991 0.401528 -0.187953 0.272975 -0.123582 -0.213739 0.285247 -0.016121 -0.193766 -0.039407 -0.016444 0.003229 -0.019727
polarizability: 1.96155981e+02 -4.97221845e+00 2.07615065e+02 -1.97593203e+01 2.79019710e+00 9.97933784e+01
1716.lowfreq: -5.2991 -0.0007 -0.0006 0.0001 4.1663 8.6600 14.4854 35.5085 43.8601
frequency: 13.4767 35.4932 43.8339 74.3300 106.5138 141.7376 164.7223 177.5436 192.7625 228.4331 240.5102 259.5058 314.2008 385.0136 395.7382 417.4838 434.4714 446.0254 472.0381 486.7555 509.1608 532.6065 559.2454 601.6631 635.5081 690.1878 738.4278 753.2730 763.7731 786.1227 793.8417 815.8378 862.5931 872.7570 888.9394 915.8438 926.7824 927.4798 942.3264 944.8214 965.4999 985.6032 994.1288 1021.5109 1042.4460 1076.5069 1090.6041 1114.2899 1150.7921 1158.1288 1174.9072 1181.9731 1183.4293 1216.9896 1239.3981 1252.5448 1278.1771 1299.7196 1324.1455 1336.6270 1380.5347 1380.9559 1396.3161 1406.4217 1420.5663 1443.3861 1456.2880 1457.3588 1465.2180 1466.2279 1472.6355 1486.7045 1518.7059 1589.7040 1600.7192 1634.5104 1638.7723 2988.7500 2991.9656 3021.5683 3029.0400 3084.1920 3086.3147 3092.5334 3096.6037 3103.7530 3120.3409 3123.2209 3132.0789 3133.7587 3151.0424 3158.3912 3164.2992
redmass: 4.1217 4.2704 3.3762 5.8333 4.2775 4.2338 3.4386 3.9828 1.0453 2.2407 1.5279 3.8188 2.7764 3.2771 3.2311 3.3434 2.5847 3.0474 3.2157 4.0288 6.0835 4.6404 3.9737 4.8677 3.4867 5.3338 1.7416 2.4662 3.5325 3.8447 2.0513 1.8245 2.5813 3.2154 2.1828 1.8177 2.1588 1.3678 2.1294 1.4129 1.3857 1.3725 1.3402 3.4118 2.4123 2.5762 2.0039 1.7403 1.4502 2.0468 1.1681 1.2857 1.6941 1.5068 1.8114 1.8329 1.6085 1.5508 1.4704 1.3766 1.8606 1.3406 1.2313 3.1182 5.2259 2.1951 2.4800 1.0582 1.0677 1.1166 1.0497 1.0480 3.7049 7.5245 5.3089 6.5157 10.0239 1.0355 1.0359 1.0596 1.0866 1.0995 1.1019 1.0987 1.1006 1.1006 1.0861 1.0860 1.0894 1.0918 1.0945 1.0992 1.0995
irintensity: 0.7567 0.0951 0.7149 1.1095 0.9495 1.1282 3.0584 2.4040 0.0290 2.9951 3.5611 3.1388 0.7466 1.9971 3.1925 5.3670 4.4170 3.1425 0.0832 5.9719 1.2921 9.0444 7.9106 2.3386 0.3409 0.3439 1.5891 5.7180 8.3523 18.1007 71.7665 53.7876 1.2180 6.6601 4.0541 8.1812 37.5998 9.1182 4.7040 1.6799 3.4180 2.9945 0.2177 10.0805 24.6516 41.1006 260.6577 43.9795 5.7505 12.0614 1.6592 1.3596 16.4026 80.4266 4.0306 16.0476 2.9020 51.1799 9.6048 3.6096 28.2714 21.9953 18.8584 4.1696 2.4023 5.7848 0.5765 6.3292 11.6118 10.1818 5.9309 21.4277 8.9877 2.3319 7.4790 2.2297 152.6464 16.0660 22.5523 14.2213 4.8202 2.6880 4.6098 55.2326 24.5365 28.9704 0.7170 0.0666 10.6229 25.3055 23.5569 36.0820 19.6583
temp: 298.150 k
press: 1.00000 atm
elementType: 8 8 6 6 6 6 6 6 6 6 6 6 6 6 6 6 6 1 1 1 1 1 1 1 1 1 1 1 1 1 1 1 1
symmnumber: 1
zpe: 707424.1 jmol-1
zpe.correction: 0.269444 hartree
zpe.thermalcorrener: 0.285195 hartree
zpe.thermalcorrenthalpy: 0.286139 hartree
zpe.thermalcorrgfe: 0.224464 hartree
zpe.sumelectzpe: -730.438584 hartree
zpe.sumelectthermal: -730.422833 hartree
zpe.sumelectthermalent: -730.421889 hartree
zpe.sumelectthermalfe: -730.483564 hartree
dipole: -0.7898 1.4567 0.8596
dipole: 1.8667
quadrupole: -85.0329 -93.5209 -104.4579
quadrupole: -4.8465 -4.4574 -4.9399
quadrupole: 9.3043 0.8163 -10.1206 -4.8465 -4.4574 -4.9399
hfenergy: -730.7080279 hartree
pointgroup: C01 [X(C15H16O2)]
dipole: 0.2302259 0.634805 -0.2887851 debye
polarizability: 193.9699225|5.287139|208.696691|-21.5634055|4.5223833|100.8978116 unknown
InChI: InChI=1S/C15H16O2/c1-11(2)17-15(16)10-13-8-5-7-12-6-3-4-9-14(12)13/h3-9,11H,10H2,1-2H3
charge 0 multiplicity 1
33 atoms
O  2.549791 0.413071 -0.493438
O  2.274001 -1.576527 0.700564
C  -0.540522 -1.203666 -0.660003
C  -1.278669 -0.011618 -0.305181
C  0.853835 -1.113315 -1.275015
C  -2.607986 -0.151233 0.26155
C  -1.11465 -2.460477 -0.436288
C  3.657453 0.839118 0.444773
C  -0.752232 1.312577 -0.488423
C  -3.155633 -1.460131 0.468938
C  1.945535 -0.822264 -0.242048
C  -2.420025 -2.594906 0.129724
C  -3.351999 1.025611 0.606494
C  -1.502688 2.439628 -0.142775
C  -2.814801 2.298623 0.408512
C  4.970578 0.196916 -0.023047
C  3.656173 2.368541 0.402103
H  1.105578 -2.087813 -1.730042
H  0.90174 -0.346383 -2.065444
H  -0.548727 -3.362325 -0.696296
H  3.387815 0.461953 1.448786
H  0.255921 1.441724 -0.89456
H  -4.159658 -1.553241 0.899843
H  -2.836588 -3.594924 0.29131
H  -4.355996 0.906553 1.031613
H  -1.084873 3.441535 -0.292783
H  5.800793 0.518584 0.632172
H  4.904974 -0.903099 0.021103
H  5.206007 0.50336 -1.057803
H  4.428358 2.763572 1.086859
H  2.67631 2.768859 0.714407
H  3.876235 2.732261 -0.617183
H  -3.392052 3.190934 0.674774
