program: Gaussian 09
title: 000239430
version: EM64L-G09RevD.01
frameworkgroup: C1[X(C11H12Br2O3)]
method: RPBEPBE
basis: SDD
operation: Freq
keyword: #p
keyword: freq=noraman
keyword: PBEPBE/SDD
title: #p freq=noraman PBEPBE/SDD
converged: YES YES NO NO
title: Mulliken charges:
elementType: Br Br O O O C C C C C C C C C C C H H H H H H H H H H H H
charge: 0.000440 -0.011962 -0.291559 -0.255536 -0.254845 -0.466700 -0.182246 0.217763 -0.637371 0.209211 -0.324001 -0.326442 0.333834 -0.345770 -0.340909 -0.537297 0.317101 0.266344 0.261440 0.308081 0.320014 0.271655 0.262471 0.258106 0.245269 0.226232 0.226337 0.250338
chargesum: 0.00000
title: Mulliken charges with hydrogens summed into heavy atoms:
elementType: Br Br O O O C C C C C C C C C C C
charge: 0.000440 -0.011962 -0.291559 -0.255536 -0.254845 -0.149599 0.345538 0.217763 -0.009276 0.209211 -0.052345 -0.063971 0.333834 -0.087664 -0.095640 0.165610
polarizability: 2.09339071e+02 -7.28932533e+00 1.56421103e+02 2.39693717e+01 -2.05842507e+01 1.41248685e+02
1716.lowfreq: -5.8405 -2.5243 -0.0004 -0.0003 0.0002 3.8191 11.8518 16.6242 41.7530
frequency: 9.0024 16.4163 41.7447 51.6426 72.2904 88.2136 121.6515 147.8802 152.9806 171.0335 185.7253 221.8299 234.7153 268.4684 292.9897 309.1999 326.7445 417.4308 444.0239 469.4356 506.5947 510.1748 554.6054 596.5988 620.9740 631.4287 676.6565 752.6563 755.4330 809.2313 821.4914 853.8812 869.8212 889.5797 942.8453 968.4890 981.0793 990.6656 996.7573 1010.2224 1051.4518 1110.8762 1115.1547 1125.2270 1137.5026 1155.4409 1173.8397 1176.0936 1222.1544 1237.2021 1244.4985 1252.0542 1299.8234 1344.9947 1363.1843 1380.7054 1431.0558 1435.9397 1438.8537 1453.8258 1468.8636 1471.3096 1498.2427 1571.8794 1620.7435 1624.5640 2968.2397 3006.5076 3060.0154 3079.9131 3086.6605 3091.0634 3132.3844 3155.3465 3157.0030 3175.0280 3178.7884 3180.8744
redmass: 5.3402 16.5917 8.4515 5.9982 5.2845 5.9948 6.1129 4.4128 4.0981 12.9516 5.0017 1.4651 2.3092 4.5305 6.1966 4.7180 2.7176 2.9678 5.7119 3.9730 2.9533 4.5923 5.0693 5.7454 4.4358 6.1217 4.2358 5.5849 4.6237 4.7430 1.3152 1.6288 3.7888 1.9444 2.2624 1.3709 7.6175 1.3545 3.0684 1.9004 4.0045 1.2597 1.3436 1.5874 1.3773 1.3160 1.2374 1.2523 1.1518 2.7730 1.5834 2.2036 1.2802 1.6968 1.3780 5.3802 4.2687 1.1754 1.1046 1.0752 1.0499 1.0789 2.5198 7.8663 6.4517 10.8805 1.0326 1.0599 1.1044 1.1015 1.0620 1.0822 1.1000 1.0885 1.0878 1.0965 1.0974 1.1123
irintensity: 1.8595 0.1599 0.8932 0.3708 0.2778 0.5200 2.3956 4.9657 3.4883 1.4117 4.0225 1.2059 7.3682 18.6916 1.2815 4.3224 9.3755 0.0617 1.9620 1.2903 3.7754 63.1755 30.7749 20.7691 14.1860 4.6956 26.6126 6.4503 13.6067 2.9702 9.2320 55.1531 1.7054 21.7617 9.8550 0.5233 78.2940 0.6901 52.2482 18.0625 363.0265 0.1745 5.1430 40.9732 15.6776 8.5953 109.4771 92.4231 21.8942 55.8660 217.7307 288.7541 0.1493 3.6181 12.7679 3.5068 25.3647 8.1117 11.7305 24.1712 14.8384 43.8502 71.8257 57.0064 137.9503 305.1169 61.4547 15.6481 41.7542 7.3662 2.8628 4.8412 22.1562 0.3690 5.6217 7.8391 4.4578 1.0842
temp: 298.150 k
press: 1.00000 atm
elementType: 35 35 8 8 8 6 6 6 6 6 6 6 6 6 6 6 1 1 1 1 1 1 1 1 1 1 1 1
symmnumber: 1
zpe: 547051.7 jmol-1
zpe.correction: 0.208361 hartree
zpe.thermalcorrener: 0.225233 hartree
zpe.thermalcorrenthalpy: 0.226177 hartree
zpe.thermalcorrgfe: 0.158254 hartree
zpe.sumelectzpe: -677.764055 hartree
zpe.sumelectthermal: -677.747183 hartree
zpe.sumelectthermalent: -677.746239 hartree
zpe.sumelectthermalfe: -677.814161 hartree
dipole: -1.8221 1.4036 -3.2172
dipole: 3.9548
quadrupole: -95.8587 -120.0105 -110.2563
quadrupole: -2.5597 14.8566 -2.9000
quadrupole: 12.8498 -11.3020 -1.5478 -2.5597 14.8566 -2.9000
hfenergy: -677.9724157 hartree
pointgroup: C01 [X(C11H12Br2O3)]
dipole: 0.8052362 1.3283658 -0.0893629 debye
polarizability: 212.3588317|20.1782754|154.2239513|-2.9842134|-21.3475046|140.4260755 unknown
InChI: InChI=1S/C11H12Br2O3/c1-15-10-4-2-8(3-5-10)11(14)16-7-9(13)6-12/h2-5,9H,6-7H2,1H3
charge 0 multiplicity 1
28 atoms
Br -3.67797 1.548443 -2.110065
Br -4.404922 0.552229 2.495932
O  -1.666771 -0.270398 -0.252777
O  4.685276 0.594844 0.192081
O  -0.990272 -2.499752 -0.179298
C  -3.983032 0.445988 -0.397954
C  -3.051973 -0.759424 -0.390946
C  0.684513 -0.725744 -0.082954
C  -3.81168 1.43275 0.751896
C  -0.684421 -1.281356 -0.172253
C  1.768202 -1.633866 0.085808
C  0.951689 0.6640 -0.167481
C  3.341314 0.232335 0.09211
C  3.084204 -1.163133 0.17401
C  2.271051 1.149623 -0.081596
C  5.021506 2.021763 0.118471
H  -5.027585 0.110481 -0.499374
H  -3.151555 -1.350565 -1.317216
H  -3.296589 -1.412916 0.468525
H  -4.462358 2.311154 0.650492
H  -2.761069 1.712897 0.904339
H  1.550661 -2.705111 0.14485
H  0.120001 1.35964 -0.310948
H  3.92972 -1.844383 0.305273
H  2.454825 2.225316 -0.152489
H  4.547214 2.586909 0.943381
H  4.719967 2.453825 -0.854753
H  6.115357 2.062049 0.220534
