program: Gaussian 09
title: 000239426
version: EM64L-G09RevD.01
frameworkgroup: C1[X(C18H24O6)]
method: RPBEPBE
basis: SDD
operation: Freq
keyword: #pfreq=noraman
keyword: PBEPBE/SDD
title: #p freq=noraman PBEPBE/SDD
converged: YES YES NO NO
title: Mulliken charges:
elementType: O O O O O O C C C C C C C C C C C C C C C C C C H H H H H H H H H H H H H H H H H H H H H H H H
charge: -0.250720 -0.277684 -0.292040 -0.248319 -0.217622 -0.221987 -0.154189 0.477638 -0.498525 -0.494101 -0.463412 -0.353889 -0.345866 -0.420828 0.351073 0.305111 0.277690 -0.205249 -0.403274 -0.684261 -0.682842 0.247242 -0.484298 -0.657015 0.279154 0.239440 0.251579 0.248323 0.245142 0.328685 0.225007 0.204025 0.213148 0.223189 0.271505 0.234449 0.259960 0.204874 0.236616 0.216164 0.209628 0.223850 0.210957 0.247164 0.247200 0.230196 0.217330 0.229780
chargesum: 0.00000
title: Mulliken charges with hydrogens summed into heavy atoms:
elementType: O O O O O O C C C C C C C C C C C C C C C C C C
charge: -0.250720 -0.277684 -0.292040 -0.248319 -0.217622 -0.221987 0.124965 0.477638 -0.007506 -0.000636 -0.134727 0.075143 0.090471 -0.149322 0.351073 0.305111 0.277690 0.029200 -0.143314 -0.026606 -0.038407 0.247242 0.010066 0.020291
polarizability: 2.61216993e+02 4.92564516e+00 2.28935504e+02 1.18930235e+01 2.81596697e+01 1.65202678e+02
1716.lowfreq: -11.6827 -2.7068 0.0004 0.0007 0.0009 3.3452 5.3441 14.6032 17.4593
frequency: -10.7060 14.3152 17.3437 23.9768 29.6648 35.9005 37.3931 44.6176 49.9518 62.2525 69.2878 89.8518 98.2314 108.1092 136.5885 156.0090 175.2635 186.0920 204.0811 225.9462 229.5907 239.3817 251.6974 265.2004 283.2021 295.2514 303.9428 322.3057 346.8122 363.0462 373.8309 436.1259 487.4167 527.4508 533.5249 546.3569 557.7744 570.6036 574.8339 624.9392 648.2685 655.8723 679.0867 703.8954 737.2270 754.4973 778.6690 790.4842 806.6281 838.6303 841.9914 849.0345 866.7323 870.0485 877.9018 908.0562 914.7903 927.6729 945.6752 959.4344 986.6437 990.4882 997.7070 1015.4288 1052.0045 1064.9454 1069.2204 1074.0891 1081.1332 1084.8577 1090.5097 1096.5344 1104.1068 1109.2529 1127.0164 1136.0837 1141.4897 1178.7016 1217.9781 1220.3813 1228.4645 1242.6908 1265.2247 1281.0913 1291.1127 1297.2155 1319.6279 1334.4479 1344.0003 1347.6487 1351.6361 1364.3136 1389.3492 1391.4048 1396.4660 1399.7215 1436.8166 1437.8981 1439.2767 1440.2848 1463.1449 1471.9040 1474.1488 1477.2937 1478.3542 1479.3073 1480.1879 1486.1862 1487.8754 1601.4456 1607.2844 1643.9417 1657.3456 1665.2333 2976.1263 2978.6253 2984.5411 2985.1919 2997.8644 3000.8596 3001.0119 3002.8290 3036.0685 3044.6606 3044.8406 3047.3857 3054.5741 3058.7182 3076.8343 3078.5298 3079.6673 3085.4972 3098.5431 3103.4776 3140.2108 3156.4170 3174.0137 3220.1581
redmass: 2.2087 3.5309 2.6915 3.0996 6.9446 3.3355 3.1211 3.7054 3.3806 7.9874 3.9368 4.5442 3.0444 2.9682 2.8994 3.7786 4.4798 1.2795 2.9083 1.1135 2.0994 4.2727 4.3838 5.2330 1.9802 5.9574 4.4590 6.1344 3.8100 4.6422 2.6901 3.2757 3.7785 2.7570 4.3206 3.3519 3.8669 6.5556 5.9463 5.3437 3.2820 4.8127 6.3380 2.3684 1.2034 4.3262 1.7039 1.3427 1.6914 4.1983 4.9043 3.1198 1.7349 1.9988 2.1393 2.1023 2.5239 1.4323 1.5146 3.4599 3.5123 1.6010 4.8588 1.8342 2.2746 1.5272 3.3694 2.9722 1.9769 1.6039 1.8885 2.0770 1.9298 2.9646 2.2651 2.0507 2.6307 1.1233 1.2837 1.3321 2.2314 1.1726 1.2493 1.1930 1.3405 1.3596 1.1615 1.7279 1.4140 1.6330 1.6256 1.7739 6.8792 1.2199 1.2153 1.2119 1.0988 1.3181 1.6944 1.1417 1.0752 1.0390 1.0527 2.6228 1.0500 1.0414 1.0528 1.0789 1.0500 6.6241 6.4890 9.5665 9.7813 10.3969 1.0361 1.0360 1.0639 1.0629 1.0548 1.0621 1.0423 1.0612 1.0959 1.0988 1.0994 1.0859 1.0993 1.0970 1.0992 1.1005 1.1002 1.1009 1.1004 1.1004 1.0875 1.0932 1.0987 1.0927
irintensity: 1.2293 0.1034 0.0765 0.1622 1.6784 0.2908 0.5150 0.9923 1.2478 0.8980 2.1609 0.8738 2.4693 0.9041 0.0152 1.8186 1.2830 0.8502 1.0393 0.6218 4.3511 1.1869 0.9654 7.1182 9.7527 17.0503 1.9451 9.4336 1.3106 3.0501 4.2817 1.6217 7.7626 0.3209 1.3554 2.7514 8.3217 0.8562 8.0455 5.5390 1.8444 3.8313 4.1316 20.3128 8.7954 35.3167 13.5488 20.9134 120.3766 11.5975 206.5554 13.9081 5.1964 5.2503 11.2977 105.6202 56.8432 4.3731 9.0135 37.8788 6.0595 5.4641 208.3258 40.7304 44.4081 1.1133 145.2402 292.2251 2.6123 0.0737 94.2884 116.8912 96.6466 329.3330 110.3246 73.3093 187.4829 1.6448 0.9267 1.2614 54.2878 0.0490 16.4439 28.2293 60.9556 30.3314 2.1730 53.5295 3.2432 48.6306 28.6687 19.9091 29.2359 15.9945 7.3073 20.5232 20.6259 4.5971 66.7213 34.5365 12.1706 12.8598 4.5368 28.4132 14.9717 13.1681 15.2029 15.3211 13.9750 60.4848 6.9410 83.8359 154.0397 184.6193 35.2432 28.8571 6.2923 18.5343 29.7493 32.2944 10.9569 22.5109 0.8880 3.5923 3.5813 7.7525 0.3425 4.4994 54.6533 59.7345 60.4335 54.3345 29.1690 30.9827 5.0036 5.1288 9.9668 8.1227
temp: 298.150 k
press: 1.00000 atm
elementType: 8 8 8 8 8 8 6 6 6 6 6 6 6 6 6 6 6 6 6 6 6 6 6 6 1 1 1 1 1 1 1 1 1 1 1 1 1 1 1 1 1 1 1 1 1 1 1 1
symmnumber: 1
zpe: 1016767.9 jmol-1
zpe.correction: 0.387266 hartree
zpe.thermalcorrener: 0.413284 hartree
zpe.thermalcorrenthalpy: 0.414228 hartree
zpe.thermalcorrgfe: 0.325443 hartree
zpe.sumelectzpe: -1149.854633 hartree
zpe.sumelectthermal: -1149.828616 hartree
zpe.sumelectthermalent: -1149.827672 hartree
zpe.sumelectthermalfe: -1149.916457 hartree
dipole: 2.8761 -0.2641 1.3000
dipole: 3.1673
quadrupole: -131.2625 -130.1399 -139.3846
quadrupole: -4.0767 -8.6255 0.4709
quadrupole: 2.3332 3.4558 -5.7889 -4.0767 -8.6255 0.4709
hfenergy: -1150.2418999 hartree
pointgroup: C01 [X(C18H24O6)]
dipole: 0.8854308 -0.6608177 -0.5762891 debye
polarizability: 225.0625956|-30.1611191|228.7626265|20.6277639|42.3368907|201.5299534 unknown
InChI: InChI=1S/C18H24O6/c1-4-8-16(20)23-18(24-17(21)9-5-2)13-10-7-11-14(12-13)22-15(19)6-3/h7,10-12,18H,4-6,8-9H2,1-3H3
charge 0 multiplicity 1
48 atoms
O  -0.536984 1.778499 -0.169813
O  -1.42701 -0.391147 -0.220846
O  3.304001 -2.438996 0.052708
O  -0.915964 3.103469 1.71854
O  -3.423876 0.792952 0.079319
O  1.877903 -2.952166 -1.755986
C  -0.74804 0.545994 0.660629
C  0.575383 -0.037687 1.096135
C  -0.724517 4.146464 -0.523029
C  -3.33716 -1.147122 -1.465233
C  1.244889 -0.993625 0.294127
C  -0.423512 5.519388 0.116408
C  -4.877796 -1.174597 -1.536051
C  1.138569 0.419271 2.310619
C  2.494162 -1.479832 0.737501
C  -0.741236 3.009884 0.483469
C  -2.803917 -0.139458 -0.468296
C  2.391852 -0.080148 2.729702
C  3.07472 -1.031701 1.946189
C  1.028433 5.644381 0.626776
C  -5.384137 -2.160228 -2.609269
C  2.951431 -3.109573 -1.142116
C  4.093414 -4.035154 -1.530487
C  3.810345 -4.818163 -2.824172
H  -1.395477 0.835091 1.508423
H  -0.000485 3.900551 -1.32111
H  -1.724252 4.154989 -1.003572
H  -2.922569 -2.1417 -1.215441
H  -2.909792 -0.888467 -2.455893
H  0.792052 -1.349042 -0.630592
H  -1.125688 5.68554 0.954231
H  -0.623732 6.304603 -0.637699
H  -5.284358 -1.452239 -0.545044
H  -5.250543 -0.155069 -1.745563
H  0.605466 1.166567 2.908344
H  2.835399 0.267817 3.668106
H  4.044452 -1.437082 2.249826
H  1.75557 5.486352 -0.192172
H  1.233171 4.900738 1.417636
H  1.211946 6.647115 1.053308
H  -5.019565 -1.879201 -3.615374
H  -6.488324 -2.174396 -2.643641
H  -5.040265 -3.191361 -2.403292
H  4.280287 -4.717267 -0.678892
H  5.009264 -3.420325 -1.623593
H  3.644958 -4.134308 -3.674036
H  4.663319 -5.476339 -3.065285
H  2.905811 -5.441473 -2.721097
