program: Gaussian 09
title: 000239419
version: EM64L-G09RevD.01
frameworkgroup: C1[X(C16H12O2)]
method: RPBEPBE
basis: SDD
operation: Freq
keyword: #pfreq=noraman
keyword: PBEPBE/SDD
title: #p freq=noraman PBEPBE/SDD
converged: NO NO NO NO
title: Mulliken charges:
elementType: O O C C C C C C C C C C C C C C C C H H H H H H H H H H H H
charge: -0.288807 -0.218992 0.272281 0.179220 0.140971 0.515411 0.182247 -0.657555 -0.389266 -0.363747 -0.375344 -0.452798 -0.256876 -0.236379 -0.257918 -0.250884 0.261762 -0.751301 0.303318 0.226938 0.224592 0.268941 0.251356 0.228557 0.230430 0.228350 0.230833 0.252963 0.248784 0.252912
chargesum: 0.00000
title: Mulliken charges with hydrogens summed into heavy atoms:
elementType: O O C C C C C C C C C C C C C C C C
charge: -0.288807 -0.218992 0.272281 0.179220 0.140971 0.515411 0.182247 -0.354237 -0.162328 -0.139155 -0.106404 -0.201442 -0.028319 -0.005949 -0.029567 -0.020051 0.261762 0.003358
polarizability: 2.55348785e+02 -2.51436692e+01 2.44669653e+02 4.81899917e-02 3.77973532e-02 7.28962828e+01
1716.lowfreq: -0.0005 -0.0004 -0.0002 1.6519 6.6756 10.5424 41.0125 54.4249 87.9227
frequency: 40.7900 54.4232 87.9154 102.3471 105.2290 116.9935 175.8880 221.3793 242.6741 264.7792 298.8447 323.8367 402.2032 421.4194 442.4056 445.2989 508.7732 514.3862 532.6605 553.5743 571.9583 604.8610 615.2145 628.4515 673.8244 708.8689 741.6239 764.1082 775.2255 779.8719 814.9016 835.5706 873.5527 875.6864 896.1833 936.3912 962.2401 969.4081 988.9541 991.1662 991.5589 996.4128 1034.4748 1039.7221 1040.7307 1051.6434 1101.7511 1145.5434 1165.1368 1177.6749 1179.4749 1203.3592 1251.8311 1254.4873 1285.2806 1314.7940 1380.0624 1383.1155 1398.9049 1404.1827 1432.5016 1447.1147 1452.5072 1452.5672 1453.6267 1496.4500 1528.1906 1579.0836 1599.6198 1620.1674 1621.8215 1658.4541 3006.2029 3095.2670 3122.9584 3128.0359 3132.5138 3143.8395 3143.8950 3149.6702 3160.8888 3165.5156 3178.5221 3196.0012
redmass: 6.6492 3.4338 1.2142 4.0362 2.9772 4.7798 5.4167 5.5604 4.0738 6.5322 4.1501 4.3228 6.4996 3.1870 3.4521 5.1315 5.2834 2.9707 6.1792 3.0985 3.4213 5.7733 6.8934 3.3773 7.0459 5.5754 2.3012 1.4167 5.6991 1.6215 1.8198 6.9589 1.4081 4.8613 1.7460 1.7787 1.4492 1.3947 2.0778 7.3807 1.3668 1.3304 4.2683 1.6356 2.0166 2.5957 2.3920 1.4937 2.6234 1.0714 1.1340 1.5688 2.7603 1.5827 1.6828 2.4436 1.9608 1.6203 5.5438 3.0765 2.4661 2.4718 1.1543 3.0148 1.0468 3.3416 3.8274 7.5748 6.4836 6.3387 6.6906 9.6480 1.0365 1.0977 1.0856 1.0858 1.0889 1.0944 1.0985 1.0932 1.0984 1.0970 1.0963 1.0928
irintensity: 3.1690 1.9909 0.2462 1.3923 0.6255 2.0207 0.1631 1.0067 1.1843 3.4153 2.4566 1.1714 1.9893 5.0151 3.4145 1.5026 14.9326 3.6461 0.3152 1.8233 3.2694 2.0938 4.1447 1.9751 8.8651 5.4586 65.4050 33.5237 5.6789 66.0880 0.9770 35.2880 3.4367 7.5970 8.3449 20.2154 5.9955 10.5703 50.7614 4.2421 1.0215 0.1404 163.8014 9.1296 11.5794 78.5921 8.8999 111.6262 445.5404 5.9021 16.0554 13.2234 67.7438 1.3229 2.7141 10.9980 38.4185 29.3460 1.8291 15.6178 4.5820 7.6275 22.6441 15.5346 19.3701 21.9375 2.5002 2.4796 38.3211 6.4794 2.4640 177.4177 1.2556 6.4436 1.6086 0.9452 8.4988 14.6034 21.5677 4.3542 29.8411 43.9391 14.2496 3.5445
temp: 298.150 k
press: 1.00000 atm
elementType: 8 8 6 6 6 6 6 6 6 6 6 6 6 6 6 6 6 6 1 1 1 1 1 1 1 1 1 1 1 1
symmnumber: 1
zpe: 607879.0 jmol-1
zpe.correction: 0.231529 hartree
zpe.thermalcorrener: 0.246012 hartree
zpe.thermalcorrenthalpy: 0.246956 hartree
zpe.thermalcorrgfe: 0.189370 hartree
zpe.sumelectzpe: -766.149629 hartree
zpe.sumelectthermal: -766.135146 hartree
zpe.sumelectthermalent: -766.134202 hartree
zpe.sumelectthermalfe: -766.191788 hartree
dipole: -0.3796 1.8383 0.0147
dipole: 1.8771
quadrupole: -81.7635 -98.0016 -109.6616
quadrupole: -5.2507 -0.0349 -0.0216
quadrupole: 14.7121 -1.5260 -13.1860 -5.2507 -0.0349 -0.0216
hfenergy: -766.381158 hartree
pointgroup: C01 [X(C16H12O2)]
dipole: 0.3346437 -0.6572887 0.0374466 debye
polarizability: 267.0953295|-18.6691585|232.435635|8.4440941|-5.1686299|73.3837568 unknown
InChI: InChI=1S/C16H12O2/c1-11(17)18-16-10-12-6-2-3-7-13(12)14-8-4-5-9-15(14)16/h2-10H,1H3
charge 0 multiplicity 1
30 atoms
O  2.429513 0.868034 0.078678
O  2.361252 3.229847 0.00777
C  -0.617032 -1.290834 0.013062
C  -1.697944 -0.303635 -0.057679
C  0.755177 -0.848714 0.05634
C  -1.356862 1.096132 -0.083387
C  1.032882 0.578463 0.028207
C  0.023188 1.521156 -0.039308
C  -0.865875 -2.697811 0.041829
C  -3.080056 -0.661494 -0.102594
C  1.812083 -1.807743 0.125615
C  -2.394662 2.077847 -0.152493
C  0.181306 -3.6267 0.109729
C  1.532223 -3.179613 0.152109
C  -4.083962 0.315433 -0.170053
C  -3.741398 1.698523 -0.195489
C  3.005488 2.164284 0.067866
C  4.509679 2.022457 0.14011
H  0.252153 2.587324 -0.059541
H  -1.895161 -3.067581 0.010126
H  -3.374528 -1.715498 -0.084383
H  2.843071 -1.446857 0.157742
H  -2.115711 3.137975 -0.171099
H  -0.040598 -4.699477 0.130259
H  2.349588 -3.907311 0.20529
H  -5.136832 0.013747 -0.203498
H  -4.529409 2.45769 -0.248277
H  4.796152 1.487615 1.062333
H  4.970271 3.020556 0.128238
H  4.876203 1.429085 -0.715505
