program: Gaussian 09
title: 000239406
version: EM64L-G09RevD.01
frameworkgroup: C1[X(C21H29FO4)]
method: RPBEPBE
basis: SDD
operation: Freq
keyword: #p
keyword: freq=noraman
keyword: PBEPBE/SDD
title: #p freq=noraman PBEPBE/SDD
converged: YES YES NO NO
title: Mulliken charges:
elementType: F O O O O C C C C C C C C C C C C C C C C C C C C C H H H H H H H H H H H H H H H H H H H H H H H H H H H H H
charge: -0.235159 -0.433801 -0.450924 -0.221253 -0.234374 0.378145 -0.100653 -0.229773 0.323643 -0.250148 0.179030 -0.625776 -0.286403 -0.596145 -0.160002 -0.457627 -0.862082 0.568778 -0.647773 -0.551106 -0.814954 0.172175 -0.530816 -0.572598 0.182724 -0.801415 0.273008 0.226919 0.276983 0.240616 0.239464 0.257733 0.229847 0.231614 0.256492 0.223286 0.242645 0.273785 0.228925 0.206525 0.222319 0.236140 0.255068 0.220544 0.211743 0.277207 0.229437 0.255450 0.234505 0.359948 0.252092 0.341651 0.254687 0.244596 0.255057
chargesum: 0.00000
title: Mulliken charges with hydrogens summed into heavy atoms:
elementType: F O O O O C C C C C C C C C C C C C C C C C C C C C
charge: -0.235159 -0.073853 -0.109272 -0.221253 -0.234374 0.378145 0.172356 -0.002854 0.323643 0.026834 0.179030 -0.145696 -0.028670 -0.134685 0.096490 0.008304 -0.152848 0.568778 -0.189314 -0.075494 -0.096566 0.172175 -0.040861 -0.320505 0.182724 -0.047075
polarizability: 2.82893384e+02 1.66407957e+00 2.09091098e+02 -1.97258320e+01 6.94650180e+00 1.97002308e+02
1716.lowfreq: -7.7052 -3.9124 -0.0004 -0.0003 0.0005 6.2762 29.9360 34.7460 54.5753
frequency: 29.7968 34.5589 54.5399 68.5893 74.0838 100.7410 117.0761 122.9154 142.2026 143.7262 155.4675 169.5862 191.0537 204.3495 214.4327 228.1594 239.6529 247.7137 259.2595 265.6905 270.2843 281.6266 289.1709 306.2115 312.5663 325.6549 335.7387 345.6266 369.3190 390.0178 399.2165 413.0017 433.8251 460.7706 469.3987 480.5700 492.4872 503.6520 514.1130 538.2152 549.6406 581.1914 587.9184 591.5673 640.3263 644.2218 660.2538 682.3996 731.5070 742.5699 760.9583 803.5410 838.6899 844.7571 850.1688 857.1825 869.8116 887.0316 906.1334 914.6666 924.2446 932.9306 946.1721 951.8426 957.5514 974.8635 981.7851 995.8221 1009.1688 1016.5463 1025.2195 1029.8245 1040.0437 1050.9692 1069.6910 1081.6954 1089.6500 1095.1501 1110.5536 1113.3796 1128.4915 1141.9268 1157.5136 1161.2990 1165.5546 1178.8928 1185.8149 1192.7943 1200.4577 1210.2115 1218.8621 1226.0932 1233.7319 1240.6874 1254.6395 1266.9544 1277.7935 1281.4031 1297.2534 1303.5454 1313.7271 1317.1748 1322.5879 1328.3762 1340.4175 1343.4657 1350.7816 1351.4303 1361.0898 1367.5170 1369.6889 1372.3661 1376.8811 1389.6357 1401.0569 1439.5215 1443.7466 1450.7269 1457.4229 1459.1144 1464.9620 1467.5078 1473.4656 1481.5820 1483.5102 1491.7467 1503.1044 1586.7410 1621.5713 1638.4100 2964.6076 2970.2105 2979.5038 2982.9852 2983.9145 2985.6275 2991.1340 2991.5204 2993.9784 2997.2881 3004.3865 3005.0431 3011.7962 3042.3686 3047.9076 3049.2991 3050.2189 3059.9658 3060.2592 3062.2240 3063.9300 3072.5840 3083.5198 3087.5606 3118.6332 3120.1141 3121.3452 3566.9959 3583.6105
redmass: 6.8163 4.7556 4.8973 4.6065 3.9403 4.9144 3.2069 1.3902 1.1007 2.3524 4.4361 3.2717 4.0643 3.9184 3.5847 3.3043 3.5396 1.5413 1.9281 3.0731 2.0269 1.7768 1.6516 2.7801 2.5417 3.2841 2.9719 3.3407 2.8463 3.0716 3.4302 3.5490 3.5234 2.8077 3.6311 3.0423 3.9267 2.6609 3.4804 3.1759 3.4258 3.0244 3.5539 3.1488 4.2599 3.3675 3.6425 3.4662 3.1190 2.4690 3.3727 2.3055 2.3683 3.0871 2.7580 2.6774 3.2976 1.5147 1.9057 2.8324 1.9222 2.4996 1.9485 2.2999 2.0715 2.0937 2.0335 1.8681 2.1351 2.3198 2.4143 2.1023 2.1413 2.4040 2.3810 2.5475 2.6843 2.6985 1.8716 2.2539 2.0314 1.9343 1.5866 2.3467 1.6735 1.6895 1.3530 1.8219 1.2965 1.6070 1.9434 1.8575 1.5202 1.6454 1.5313 1.4723 2.0138 1.5882 1.5414 1.4326 1.5527 1.3212 1.5243 1.4826 2.2529 1.4048 1.3615 1.3410 1.3135 1.1993 1.2717 1.4217 1.4938 1.2061 1.2055 1.0811 1.0780 1.0624 1.0783 1.0875 1.0795 1.0907 1.0690 1.0550 1.0773 1.0562 1.0578 9.8048 7.1360 8.0059 1.0616 1.0591 1.0377 1.0686 1.0711 1.0603 1.0698 1.0654 1.0608 1.0401 1.0819 1.0600 1.0831 1.0952 1.0930 1.0982 1.0983 1.0941 1.1027 1.0946 1.1002 1.1009 1.0949 1.0969 1.0985 1.0916 1.1005 1.0663 1.0661
irintensity: 2.5916 0.7763 1.1399 0.2330 6.2944 2.4683 3.1274 82.4956 0.8087 3.0864 0.7331 1.1572 2.1929 8.3195 3.2168 12.7579 2.0565 18.9053 0.4927 39.2675 3.2969 33.0427 80.2509 0.2665 1.9225 4.3430 2.1885 1.3554 1.5311 1.4685 13.9408 3.1481 1.9894 9.9291 6.3800 1.5009 2.9229 2.4478 3.3049 9.8016 3.0793 0.9222 6.0389 7.1197 3.2862 3.2845 2.1944 3.6971 9.7234 11.0725 1.6973 3.3212 3.6471 23.7840 17.9915 9.3523 3.9683 23.7683 2.3749 8.0311 10.1348 27.0460 3.7642 4.6729 18.6084 14.2735 17.3635 12.2230 48.3254 23.5160 8.8237 4.9737 16.2014 1.8635 13.6152 12.7835 11.9354 3.9386 8.9634 4.0128 3.2080 0.8982 33.7145 8.9416 50.3349 11.2309 1.9736 15.9105 7.9146 60.7558 21.5173 8.4264 52.2475 12.1687 19.0837 9.5946 25.7057 17.5376 16.1166 7.0004 7.4266 0.7847 46.9923 15.4156 12.0747 0.4834 3.6856 0.6385 12.2041 21.3406 60.2424 0.5344 19.9605 14.6636 37.6662 14.8978 17.0916 12.6781 5.2247 16.9579 12.3808 10.6037 6.2511 7.7311 20.6129 8.8157 5.8003 198.3215 106.9767 141.2120 9.6779 14.2053 1.8540 18.0938 11.6729 23.2372 11.4711 21.2472 33.8412 42.6282 6.4704 13.1411 33.9414 11.1795 14.0602 21.3102 49.7605 24.5789 31.0692 6.7738 26.6853 15.8982 13.5990 41.9342 6.6839 12.5330 16.5625 6.2624 19.8064
temp: 298.150 k
press: 1.00000 atm
elementType: 9 8 8 8 8 6 6 6 6 6 6 6 6 6 6 6 6 6 6 6 6 6 6 6 6 6 1 1 1 1 1 1 1 1 1 1 1 1 1 1 1 1 1 1 1 1 1 1 1 1 1 1 1 1 1
symmnumber: 1
zpe: 1211114.2 jmol-1
zpe.correction: 0.461289 hartree
zpe.thermalcorrener: 0.486805 hartree
zpe.thermalcorrenthalpy: 0.487749 hartree
zpe.thermalcorrgfe: 0.408105 hartree
zpe.sumelectzpe: -1216.357619 hartree
zpe.sumelectthermal: -1216.332103 hartree
zpe.sumelectthermalent: -1216.331159 hartree
zpe.sumelectthermalfe: -1216.410803 hartree
dipole: -4.3613 0.9174 3.2268
dipole: 5.5022
quadrupole: -204.1869 -144.0699 -159.5329
quadrupole: -3.3266 21.4180 8.5394
quadrupole: -34.9237 25.1933 9.7304 -3.3266 21.4180 8.5394
hfenergy: -1216.8189083 hartree
pointgroup: C01 [X(C21H29F1O4)]
dipole: 1.7206565 0.3437646 -1.2677955 debye
polarizability: 283.1154705|-1.6362146|208.77768|-19.2020471|-7.3055713|197.0936398 unknown
InChI: InChI=1S/C21H29FO4/c1-11(23)18-16(25)9-15-14-5-4-12-8-13(24)6-7-20(12,3)21(14,22)17(26)10-19(15,18)2/h8,14-18,25-26H,4-7,9-10H2,1-3H3
charge 0 multiplicity 1
55 atoms
F  -1.146681 0.040332 1.309896
O  -0.15902 -2.556656 -1.139621
O  3.861984 2.353635 1.394075
O  5.392348 -0.587928 -0.540681
O  -5.773121 0.193766 1.823622
C  2.083077 -0.385219 -0.124264
C  1.235342 0.928211 -0.059425
C  -0.133119 0.808753 -0.758682
C  -0.939784 -0.367965 -0.127902
C  3.37759 0.117409 0.636225
C  -2.390836 -0.508265 -0.736081
C  1.293301 -1.491454 0.615382
C  -0.142511 -1.703604 0.062534
C  2.227123 2.020314 -0.511577
C  3.569242 1.589271 0.162703
C  -0.925927 2.141711 -0.680955
C  2.457684 -0.797269 -1.577488
C  -3.066991 0.860571 -0.542479
C  -2.378639 2.023052 -1.225911
C  -3.243466 -1.645405 -0.088678
C  -2.33558 -0.828905 -2.268927
C  4.618517 -0.755136 0.443295
C  -3.901097 -1.288086 1.260806
C  -4.163099 1.041474 0.257342
C  -4.717416 -0.003137 1.146786
C  4.879013 -1.831028 1.485475
H  1.024839 1.105825 1.0165
H  0.024517 0.566322 -1.828969
H  3.132758 0.162123 1.715582
H  1.205075 -1.211127 1.682526
H  1.807948 -2.471243 0.571289
H  -0.705503 -2.292216 0.806407
H  2.32955 2.035843 -1.613945
H  1.930698 3.031811 -0.18326
H  4.42147 1.665292 -0.540223
H  -0.381072 2.919793 -1.247632
H  -0.966835 2.466883 0.375941
H  3.242483 -0.147087 -1.999099
H  2.870094 -1.823802 -1.601635
H  1.595286 -0.746285 -2.269507
H  -2.344657 1.875232 -2.323253
H  -2.92564 2.964117 -1.037994
H  -2.640904 -2.566342 -0.002222
H  -4.053049 -1.883507 -0.806599
H  -1.642069 -0.183632 -2.833012
H  -2.023873 -1.874637 -2.414418
H  -3.344564 -0.690007 -2.698167
H  -3.131144 -1.124235 2.038381
H  -4.564824 -2.09869 1.609994
H  0.626328 -2.35314 -1.704648
H  -4.646953 2.024972 0.322352
H  4.171742 3.260722 1.145182
H  5.183721 -1.348951 2.435245
H  3.961018 -2.407088 1.705019
H  5.681626 -2.507688 1.153498
