program: Gaussian 09
title: 000239405
version: EM64L-G09RevD.01
frameworkgroup: C1[X(C21H27FO3)]
method: RPBEPBE
basis: SDD
operation: Freq
keyword: #p
keyword: freq=noraman
keyword: PBEPBE/SDD
title: #p freq=noraman PBEPBE/SDD
converged: YES YES NO NO
title: Mulliken charges:
elementType: F O O O C C C C C C C C C C C C C C C C C C C C C H H H H H H H H H H H H H H H H H H H H H H H H H H H
charge: -0.233279 -0.469483 -0.233215 -0.237826 -0.253354 0.279622 -0.157212 0.294025 0.153606 -0.203773 -0.645727 -0.442329 -0.585496 0.596797 -0.653069 0.294981 -0.504685 -0.842829 -0.802559 -0.353153 -0.571949 -0.592416 0.088246 0.180963 -0.777212 0.259774 0.272695 0.243987 0.240089 0.265793 0.214402 0.239222 0.236689 0.234694 0.221234 0.241955 0.243107 0.240377 0.263117 0.218701 0.244555 0.227050 0.208663 0.293154 0.243544 0.247006 0.228733 0.251679 0.357743 0.240471 0.233583 0.259309
chargesum: 0.00000
title: Mulliken charges with hydrogens summed into heavy atoms:
elementType: F O O O C C C C C C C C C C C C C C C C C C C C C
charge: -0.233279 -0.111740 -0.233215 -0.237826 0.006421 0.279622 0.115483 0.294025 0.153606 0.040214 -0.139846 0.011296 -0.114112 0.596797 -0.189880 0.294981 -0.021201 -0.116455 -0.073693 -0.109609 -0.096210 -0.340736 0.088246 0.180963 -0.043850
polarizability: 2.92361264e+02 -1.32554129e+00 2.21642205e+02 -9.92411691e+00 1.80194715e+00 1.68592608e+02
1716.lowfreq: -16.0884 -9.2889 0.0003 0.0004 0.0005 8.4877 31.1967 54.1920 62.5964
frequency: 31.0499 54.1701 62.5567 65.1661 93.6307 95.5058 124.3332 142.1487 158.3183 178.2260 186.9539 203.4064 210.0510 220.3525 227.3168 245.5981 249.3966 265.3610 277.2815 283.9871 296.5162 305.9386 309.1281 331.1588 348.7329 361.3577 368.7309 377.3681 411.3508 438.8941 448.7692 453.5195 471.9400 502.6344 507.0027 518.7473 525.1444 540.7212 577.4162 598.3114 601.8709 635.4933 656.6106 665.0822 671.4986 702.3239 755.7642 772.1528 800.6525 828.0968 829.5318 847.2789 852.6972 859.1352 884.0948 898.5191 915.1149 933.6298 942.2971 947.5797 954.4317 963.9018 975.9193 984.1135 1004.8202 1023.1859 1024.4524 1030.0363 1035.9815 1044.7914 1063.5141 1071.2578 1088.1122 1095.7170 1112.1698 1122.7971 1131.1161 1138.5233 1155.8829 1166.5754 1182.8236 1190.8334 1200.8627 1204.8164 1215.2859 1231.7477 1237.2226 1252.3954 1259.9856 1272.6768 1278.2244 1281.6644 1297.5451 1304.9919 1325.8418 1328.2259 1332.8888 1341.1821 1341.8025 1349.6809 1352.1447 1355.4419 1370.3403 1380.3676 1382.5375 1390.6298 1392.4033 1443.4890 1446.0061 1454.3349 1456.8265 1458.5967 1459.3870 1466.5026 1473.7625 1475.6014 1477.0297 1499.0024 1504.3090 1568.8685 1584.8844 1596.4045 1630.8175 2950.4548 2952.8460 2967.6288 2978.5905 2979.7657 2984.0690 2987.3595 2993.5274 2993.8700 2996.7811 3000.3845 3002.0823 3038.7955 3039.6486 3044.0227 3056.5699 3059.1639 3066.0772 3071.4967 3073.8490 3079.7965 3101.0703 3118.4904 3122.4185 3130.1953 3151.0726 3563.3885
redmass: 5.5686 2.8511 3.7235 5.1341 2.1672 1.9502 3.8909 3.3148 4.2313 2.0039 3.0948 4.0904 2.8114 2.9633 3.5332 2.4711 2.0019 2.5580 1.6135 4.2879 2.6113 2.1001 2.8840 1.3575 3.2123 2.4701 3.7587 3.3544 3.1295 3.3220 3.3059 4.2391 4.1521 3.4342 3.0321 3.8136 2.5070 3.4064 3.0693 3.6808 4.1052 3.6104 3.0192 4.7231 3.2236 3.1793 3.9131 2.1600 2.3324 1.3883 2.6427 2.7941 2.9207 2.9839 1.4818 2.4899 2.0542 1.8885 1.8146 1.9964 1.9402 2.5214 2.1637 2.0661 2.7368 1.9273 1.7899 1.8637 1.8815 2.0363 2.3206 2.3334 2.8033 2.0607 1.8279 1.9302 1.8593 1.8986 2.2245 2.0630 1.6613 1.7341 1.7762 2.2522 1.5847 1.8720 1.6204 1.9947 1.4744 1.4532 1.6785 1.7765 1.4183 1.7327 1.4971 1.5933 1.7401 1.6548 1.5833 1.5430 1.5200 1.3799 1.3479 1.3987 1.4273 1.2313 1.2852 1.0793 1.1026 1.0989 1.0831 1.0886 1.0504 1.0850 1.0647 1.0641 1.0689 1.0551 1.0601 6.8164 9.9054 7.1657 7.9621 1.0691 1.0664 1.0784 1.0658 1.0697 1.0374 1.0368 1.0605 1.0721 1.0419 1.0610 1.0781 1.0936 1.0929 1.1005 1.1026 1.0971 1.1007 1.0989 1.0971 1.0982 1.0981 1.0912 1.0998 1.0978 1.0950 1.0659
irintensity: 1.7002 6.7862 0.2795 0.5191 2.0458 1.0522 0.6442 0.0189 3.9852 2.1167 0.8759 2.9913 4.6905 4.9695 1.6212 1.7428 1.4689 0.1563 58.8522 9.1880 22.0201 27.3641 2.2845 49.7806 17.8531 0.2181 2.1563 1.5983 3.2573 8.8975 1.9710 2.1069 0.9321 5.5707 3.0616 2.8122 1.0408 1.2049 4.6261 4.9907 6.6735 8.6526 2.3152 12.0123 5.6262 3.8549 0.9891 7.4557 4.1296 14.9577 7.9275 13.5008 7.4426 31.4078 20.7017 5.7148 32.4236 5.8343 11.8888 20.7992 10.1756 11.7487 14.3295 14.4429 23.1016 2.5377 5.1418 8.9907 17.9763 17.4309 4.2969 26.0812 3.9210 3.5274 18.9823 5.4781 3.6112 22.0073 12.6257 5.2891 3.5047 10.8328 5.6008 8.9793 6.7625 19.8559 20.4663 40.6966 13.2660 0.6666 31.9541 15.4656 22.9576 8.7818 4.6048 17.2251 21.0750 7.6227 5.0039 12.6598 10.1535 1.5736 82.2286 3.5017 16.9005 20.3912 28.0930 21.7700 19.1956 16.1545 34.1609 3.2062 19.2166 6.0054 19.8997 2.0699 0.9572 6.5699 14.3112 90.4195 188.6578 80.4732 166.6376 12.6776 15.8604 10.4057 17.7271 3.9935 31.2262 3.4988 30.8034 30.6691 22.3298 24.8901 24.7790 4.8411 44.8679 17.5426 24.1855 15.8569 21.5636 15.8612 11.5149 36.3765 13.1295 10.6699 14.3883 2.0222 20.4119 6.7127
temp: 298.150 k
press: 1.00000 atm
elementType: 9 8 8 8 6 6 6 6 6 6 6 6 6 6 6 6 6 6 6 6 6 6 6 6 6 1 1 1 1 1 1 1 1 1 1 1 1 1 1 1 1 1 1 1 1 1 1 1 1 1 1 1
symmnumber: 1
zpe: 1141289.6 jmol-1
zpe.correction: 0.434694 hartree
zpe.thermalcorrener: 0.458398 hartree
zpe.thermalcorrenthalpy: 0.459342 hartree
zpe.thermalcorrgfe: 0.383941 hartree
zpe.sumelectzpe: -1140.037233 hartree
zpe.sumelectthermal: -1140.013530 hartree
zpe.sumelectthermalent: -1140.012585 hartree
zpe.sumelectthermalfe: -1140.087986 hartree
dipole: -6.1587 2.7069 2.7164
dipole: 7.2551
quadrupole: -183.4904 -139.7415 -152.0765
quadrupole: -13.7194 14.8508 1.4063
quadrupole: -25.0543 18.6946 6.3597 -13.7194 14.8508 1.4063
hfenergy: -1140.4719274 hartree
pointgroup: C01 [X(C21H27F1O3)]
dipole: -2.4503957 -1.0349499 -1.0352988 debye
polarizability: 292.8235504|1.3146704|221.4591164|6.3893122|3.643361|168.3134099 unknown
InChI: InChI=1S/C21H27FO3/c1-12(23)15-6-7-16-17-5-4-13-10-14(24)8-9-20(13,3)21(17,22)18(25)11-19(15,16)2/h6,10,16-18,25H,4-5,7-9,11H2,1-3H3
charge 0 multiplicity 1
52 atoms
F  0.861169 -0.152603 1.527235
O  -0.037403 2.310554 -1.045331
O  -4.678558 1.874066 0.571281
O  6.168217 0.08767 1.080876
C  -0.05292 -0.997195 -0.546531
C  0.696934 0.220865 0.074333
C  -1.453856 -1.081448 0.081218
C  -2.307329 0.208651 -0.151719
C  2.173191 0.398286 -0.457283
C  -0.134074 1.543036 0.218324
C  -1.613199 1.335923 0.645042
C  0.752029 -2.296383 -0.295058
C  -2.423668 -2.247667 -0.246179
C  2.920224 -0.9349 -0.255909
C  2.225154 -2.190533 -0.750948
C  -3.679308 -0.289082 0.345567
C  2.864154 1.544654 0.343701
C  -2.489914 0.583486 -1.656232
C  2.209771 0.715813 -1.990387
C  -3.742255 -1.656452 0.237785
C  4.400718 1.54646 0.21099
C  4.193032 -0.99342 0.248611
C  -4.799998 0.615191 0.706418
C  5.006652 0.193492 0.578904
C  -6.096843 0.011574 1.239869
H  -0.137955 -0.821979 -1.636779
H  -1.294926 -1.138094 1.179146
H  0.365491 2.129233 1.015791
H  -1.624386 1.079033 1.721533
H  -2.159874 2.293884 0.544388
H  0.262261 -3.13606 -0.823771
H  0.721544 -2.522322 0.786965
H  -2.166545 -3.194137 0.262927
H  -2.475238 -2.471476 -1.334111
H  2.25219 -2.186782 -1.861888
H  2.790651 -3.084159 -0.430291
H  2.609233 1.426143 1.413198
H  2.459506 2.514904 0.002647
H  -1.536741 0.861276 -2.133693
H  -2.94188 -0.253269 -2.219983
H  -3.174829 1.447281 -1.733882
H  3.259888 0.816873 -2.317029
H  1.754908 -0.087262 -2.595947
H  1.670073 1.650749 -2.196519
H  -4.632339 -2.265177 0.432262
H  4.857032 2.32321 0.849603
H  4.704989 1.775652 -0.830984
H  4.691429 -1.962432 0.384366
H  -0.744625 3.003686 -1.03149
H  -5.908403 -0.58973 2.148098
H  -6.559336 -0.656432 0.48963
H  -6.800939 0.823147 1.479433
