program: Gaussian 09
title: 000019703
version: EM64L-G09RevD.01
frameworkgroup: C1[X(C16H12N2O5S)]
method: RPBEPBE
basis: SDD
operation: Freq
keyword: #p
keyword: freq=noraman
keyword: PBEPBE/SDD
title: #p freq=noraman PBEPBE/SDD
converged: NO YES NO NO
title: Mulliken charges:
elementType: S O O O O O N N C C C C C C C C C C C C C C C C H H H H H H H H H H H H
charge: 0.946183 -0.323344 -0.542073 -0.535533 -0.226079 -0.230128 -0.473613 -0.716808 0.179658 -0.065179 0.524236 0.233736 0.180535 -0.223915 -0.203051 -0.316951 -0.435848 0.142033 -0.361573 0.122823 -0.346648 -0.361602 -0.240347 -0.201988 0.283417 0.285357 0.319101 0.237168 0.350626 0.299836 0.284898 0.257669 0.243159 0.242436 0.336279 0.335527
chargesum: 0.00000
title: Mulliken charges with hydrogens summed into heavy atoms:
elementType: S O O O O O N N C C C C C C C C C C C C C C C C
charge: 0.946183 -0.323344 -0.542073 -0.535533 -0.226079 -0.230128 -0.122987 -0.045002 0.179658 -0.065179 0.524236 0.233736 0.180535 0.059502 0.082306 0.002150 -0.198680 0.142033 -0.061737 0.122823 -0.061750 -0.103933 0.002813 0.040448
polarizability: 4.11883618e+02 -9.22033210e+00 2.50716245e+02 -3.03153377e+00 -1.09239988e-01 1.06335875e+02
1716.lowfreq: -0.0013 -0.0008 -0.0003 2.6849 3.7815 8.5702 17.8282 24.2726 39.4063
frequency: 17.7553 24.2643 39.4034 42.3886 63.7139 83.8345 107.5393 110.8725 118.1327 140.9601 154.1523 175.6272 198.8195 203.0806 263.4036 267.1841 276.8647 281.9125 297.5550 326.1704 353.9466 376.8614 394.1801 414.1486 426.3718 430.5551 471.8502 489.8011 500.6731 504.6822 525.8716 546.4513 564.7427 590.9923 619.6933 635.7780 666.7247 713.1585 720.6530 735.6699 751.7365 762.2168 781.1899 785.1467 795.3473 808.5461 825.8389 839.4377 851.6767 872.1745 884.3395 907.5772 913.6532 916.6976 965.9399 975.0846 990.2999 1001.4975 1006.0824 1019.6447 1050.0637 1060.7532 1070.9093 1071.9547 1123.1382 1127.1316 1164.2603 1186.7197 1191.8455 1209.6423 1241.0195 1262.9938 1280.0373 1300.5926 1329.6239 1382.2252 1398.5919 1409.3223 1445.9157 1460.4358 1477.2832 1519.0553 1534.4147 1559.5611 1576.4946 1597.1734 1601.8028 1612.6055 1618.6343 1631.5201 3130.6354 3144.0783 3154.5485 3160.6372 3166.5294 3166.6999 3178.0557 3189.9612 3198.9483 3364.5567 3493.4090 3532.1323
redmass: 6.9507 8.1663 3.9312 7.5282 5.7870 5.9757 8.4722 1.5594 5.7053 6.6971 10.1955 5.0811 6.2064 7.2337 6.3961 2.7442 6.8330 7.4365 8.9488 8.4675 8.8075 6.0145 5.5238 2.9648 3.6689 9.7498 4.0848 6.6062 5.1774 11.3370 4.2430 3.0864 6.2384 8.4181 7.2087 6.4033 3.4292 5.8155 1.5799 3.6291 2.5996 2.6355 5.7232 1.5509 2.8732 3.0046 5.7550 1.3802 5.9930 1.4695 1.4238 4.2015 6.1208 1.4782 1.3835 1.3689 5.1240 1.3414 1.3364 2.5205 4.1023 2.3512 2.7158 1.7069 1.5498 1.3658 1.3208 1.1336 2.0926 3.0485 1.8399 2.2816 1.6493 1.4193 3.7879 5.3420 9.9364 4.3990 2.6318 2.6087 2.3814 2.2544 1.0858 9.7509 7.7446 7.6669 5.8995 4.7188 6.7722 8.5796 1.0902 1.0863 1.0901 1.0914 1.0953 1.0955 1.1008 1.0925 1.0952 1.0414 1.0762 1.1001
irintensity: 0.4460 1.1299 2.0091 0.5352 2.5377 1.9782 2.2332 34.6450 5.5059 1.2466 0.5294 7.4413 3.8940 3.0887 1.1933 5.1010 12.8476 2.9025 2.7720 16.7794 36.7924 5.9258 1.6676 0.1430 3.0917 50.0061 116.2605 13.2132 28.0988 1.9429 7.6520 72.7384 60.8247 0.3690 0.4124 22.6114 2.9749 1.2387 19.2435 3.2997 11.2980 63.7465 66.8532 57.0468 26.2073 221.2228 4.9891 41.7482 52.4394 63.3409 0.0056 36.2929 48.4348 22.1936 1.0771 2.7190 0.4410 2.6831 0.1719 4.7882 13.3759 58.7007 8.2295 21.4393 52.4092 9.1256 1.2291 10.5727 28.7003 76.1089 0.5804 28.9636 2.2780 40.1077 232.8571 140.8633 13.6310 25.4705 98.7384 0.0296 26.9667 620.3942 28.6800 193.7703 25.7506 147.0260 12.4092 125.4657 28.5188 57.4941 10.0155 2.4540 2.6822 2.2860 9.8864 4.7029 16.2485 5.2203 7.3765 30.9478 53.0639 24.9600
temp: 298.150 k
press: 1.00000 atm
elementType: 16 8 8 8 8 8 7 7 6 6 6 6 6 6 6 6 6 6 6 6 6 6 6 6 1 1 1 1 1 1 1 1 1 1 1 1
symmnumber: 1
zpe: 663368.1 jmol-1
zpe.correction: 0.252664 hartree
zpe.thermalcorrener: 0.274186 hartree
zpe.thermalcorrenthalpy: 0.275131 hartree
zpe.thermalcorrgfe: 0.199808 hartree
zpe.sumelectzpe: -1498.735953 hartree
zpe.sumelectthermal: -1498.714430 hartree
zpe.sumelectthermalent: -1498.713486 hartree
zpe.sumelectthermalfe: -1498.788808 hartree
dipole: 3.1312 6.1520 2.8461
dipole: 7.4667
quadrupole: -162.5543 -147.5368 -151.3703
quadrupole: 28.2050 -23.6648 1.2934
quadrupole: -8.7338 6.2836 2.4501 28.2050 -23.6648 1.2934
hfenergy: -1498.9886162 hartree
pointgroup: C01 [X(C16H12N2O5S1)]
dipole: 1.2845538 2.3900557 1.1257128 debye
polarizability: 411.4279075|-12.048399|251.0884047|-5.7635419|1.0801122|106.4194262 unknown
InChI: InChI=1S/C16H12N2O5S/c17-24(21,22)11-7-5-10(6-8-11)18-16(20)15-9-13(19)12-3-1-2-4-14(12)23-15/h1-9,18H,17H2
charge 0 multiplicity 1
36 atoms
S  -6.382494 0.431542 -0.04985
O  2.238923 0.426997 -0.003335
O  -6.706405 1.929538 -0.604933
O  -7.013272 -0.926288 -0.690683
O  5.259279 -2.474132 -0.001775
O  0.059173 -2.44698 -0.007992
N  -0.333504 -0.115604 -0.004412
N  -6.847239 0.438343 1.734397
C  4.645276 -0.125319 -0.004388
C  -4.518474 0.23609 -0.016774
C  -1.748271 -0.047714 -0.008782
C  3.596498 0.830836 -0.004646
C  1.947174 -0.94661 -0.003596
C  -3.976028 -1.057751 -0.035337
C  -3.7326 1.40016 -0.006208
C  -2.57495 -1.206338 -0.030814
C  -2.335099 1.249584 -0.003338
C  4.347016 -1.587105 -0.002906
C  2.913892 -1.917263 -0.003488
C  0.471813 -1.250442 -0.004515
C  5.982505 0.351428 -0.005903
C  3.841252 2.219128 -0.006388
C  6.249853 1.730643 -0.007646
C  5.176971 2.663862 -0.007937
H  -4.632401 -1.932695 -0.077086
H  -4.203482 2.387705 -0.024966
H  -2.115578 -2.195751 -0.045618
H  -1.696284 2.140834 0.000588
H  0.173316 0.776049 -0.001677
H  2.599461 -2.963833 -0.003896
H  6.783278 -0.395458 -0.005822
H  3.002216 2.920904 -0.007063
H  7.28337 2.090677 -0.009024
H  5.386545 3.738545 -0.00965
H  -7.321512 1.335485 1.93215
H  -7.446216 -0.385666 1.910712
