program: Gaussian 09
title: 000019777
version: EM64L-G09RevD.01
frameworkgroup: C1[X(C18H21NO2)]
method: RPBEPBE
basis: SDD
operation: Freq
keyword: #p
keyword: freq=noraman
keyword: PBEPBE/SDD
title: #p freq=noraman PBEPBE/SDD
converged: YES YES NO NO
title: Mulliken charges:
elementType: O O N C C C C C C C C C C C C C C C C C C H H H H H H H H H H H H H H H H H H H H H
charge: -0.503456 -0.295546 -0.396206 -0.227362 0.369112 0.038843 -0.013209 0.400069 -0.382652 -0.718992 -0.669869 -0.487844 0.138677 -0.788543 -0.510704 0.486241 -0.375655 -0.446256 -0.226599 -0.220635 -0.245396 0.178132 0.239093 0.210704 0.221389 0.232811 0.222927 0.217723 0.228514 0.233170 0.242312 0.259500 0.203946 0.266963 0.223081 0.371618 0.370871 0.247664 0.230618 0.224019 0.223977 0.226952
chargesum: 0.00000
title: Mulliken charges with hydrogens summed into heavy atoms:
elementType: O O N C C C C C C C C C C C C C C C C C C
charge: -0.132585 -0.295546 -0.024588 -0.049230 0.369112 0.038843 -0.013209 0.400069 -0.143559 -0.054089 -0.000705 -0.254673 0.138677 -0.082785 -0.020660 0.486241 -0.127991 -0.215638 -0.002580 0.003342 -0.018444
polarizability: 2.67228834e+02 -1.59957948e+01 2.09282147e+02 -1.59021612e+01 6.05868319e+00 1.59414683e+02
1716.lowfreq: -7.2439 -4.6770 -0.6882 -0.0008 -0.0005 -0.0004 12.2370 24.5255 26.6430
frequency: 11.1124 24.5163 26.6307 33.0893 56.6751 82.3102 97.1487 125.3785 182.0811 187.6060 201.7539 212.6550 223.1619 233.2499 259.5196 261.9572 276.1945 298.5721 324.0507 336.9912 374.4401 386.9201 393.8777 404.7745 422.8646 432.7059 479.1964 491.5077 522.5310 551.0479 583.4427 599.5212 616.8229 619.2017 703.1340 705.0555 712.2195 727.2027 747.8008 758.7689 779.8127 806.0813 825.4232 849.7022 855.3603 899.4533 913.7412 918.5878 945.0272 955.7047 960.6708 977.6341 989.4136 990.1618 996.2271 1025.9839 1032.5760 1045.0257 1059.1222 1071.3115 1085.1218 1117.0812 1139.6971 1153.3452 1170.8866 1184.9991 1185.5719 1199.6025 1214.4233 1234.6739 1250.4360 1262.7436 1269.0848 1281.2281 1310.7313 1328.9120 1348.2759 1371.6505 1381.0824 1386.0899 1398.6101 1403.2456 1406.9654 1440.8287 1446.7804 1461.9403 1464.1795 1465.1287 1472.5924 1474.0351 1482.6877 1486.5966 1490.9216 1521.1153 1568.6099 1586.0052 1594.7157 1615.0967 1619.0384 2877.6302 2968.0680 2977.3922 2984.0656 2992.3397 3031.3191 3073.6406 3075.5707 3081.6009 3088.0493 3088.6278 3089.8338 3113.1126 3122.6931 3132.9699 3135.1279 3145.7989 3159.3014 3161.8848 3455.9191 3578.8563
redmass: 4.2807 3.8396 4.4002 6.9131 3.6001 3.2915 4.3114 3.6719 3.5884 1.9396 1.3301 1.6164 2.9666 2.3686 1.5719 1.6649 3.0519 3.0415 1.2856 4.8413 5.8631 3.2411 3.9111 2.8268 2.7546 3.1137 3.8243 4.0429 4.5426 4.6218 4.1476 3.6302 6.2596 3.7827 2.6237 2.6045 5.8030 3.3015 1.2455 1.9078 6.0537 4.1343 1.3378 3.3014 1.2569 2.4197 1.4612 1.1842 3.1713 1.3412 1.4484 1.3886 1.8465 5.5050 1.5095 2.1573 1.9183 1.5713 1.9868 2.1511 1.6118 2.4714 3.1653 1.7300 1.0538 1.2809 1.2048 2.1074 2.7031 1.2065 2.5022 1.6998 3.1450 1.6223 1.3927 2.0276 1.4212 2.2436 1.1940 5.7630 1.5324 2.0941 1.2477 2.1554 1.0640 1.1309 1.3285 1.6328 1.1104 1.3248 1.0798 1.7351 1.0700 1.9409 4.8735 4.7661 6.1133 6.0608 6.5753 1.0814 1.0634 1.0352 1.0357 1.0375 1.0962 1.1004 1.0998 1.0994 1.0991 1.1004 1.0968 1.0869 1.0860 1.0875 1.0914 1.0959 1.0957 1.1015 1.0801 1.0654
irintensity: 0.2229 0.1567 0.1647 6.0418 1.4268 0.1476 0.1435 0.7238 3.2145 0.3958 1.1975 0.7096 3.8455 0.3924 5.1038 5.4138 7.2855 2.2149 87.3946 12.6477 0.9713 0.5896 5.3558 0.9439 3.7190 7.3362 15.2344 29.4521 6.2492 4.6285 8.8111 8.1091 0.5352 1.0886 29.6199 28.1821 0.9227 28.6292 74.7885 80.8410 7.5006 11.2220 24.1614 4.6077 0.6810 12.6897 5.9485 4.2303 30.5622 0.8000 1.8351 0.3408 11.8713 0.9417 3.0776 14.3594 5.4490 9.2950 4.3990 20.6772 11.4851 7.1779 24.6001 35.3681 0.0685 2.3989 4.2681 40.9597 2.9887 103.2112 18.1238 23.1848 41.3738 22.6796 10.5386 25.4391 2.7234 7.2429 14.2656 7.0727 11.9360 17.2023 18.2825 20.9228 21.4032 62.6675 1.5711 3.8332 5.2701 28.4966 19.3404 5.4197 13.3158 396.9630 101.3993 75.8708 5.5677 12.2769 71.4193 42.4263 54.6758 28.6356 26.5004 33.3078 21.6794 32.7254 9.9039 57.2745 28.9979 33.9896 11.4709 8.9160 0.2923 11.4237 17.8852 44.1726 22.1020 23.6935 140.0710 44.5270
temp: 298.150 k
press: 1.00000 atm
elementType: 8 8 7 6 6 6 6 6 6 6 6 6 6 6 6 6 6 6 6 6 6 1 1 1 1 1 1 1 1 1 1 1 1 1 1 1 1 1 1 1 1 1
symmnumber: 1
zpe: 910317.7 jmol-1
zpe.correction: 0.346722 hartree
zpe.thermalcorrener: 0.367338 hartree
zpe.thermalcorrenthalpy: 0.368282 hartree
zpe.thermalcorrgfe: 0.294785 hartree
zpe.sumelectzpe: -902.201568 hartree
zpe.sumelectthermal: -902.180952 hartree
zpe.sumelectthermalent: -902.180008 hartree
zpe.sumelectthermalfe: -902.253505 hartree
dipole: -2.7717 -4.9140 0.0179
dipole: 5.6418
quadrupole: -109.5285 -127.1694 -120.3684
quadrupole: -0.0865 -2.5214 5.2414
quadrupole: 9.4936 -8.1473 -1.3463 -0.0865 -2.5214 5.2414
hfenergy: -902.54829 hartree
pointgroup: C01 [X(C18H21N1O2)]
dipole: -1.4870131 -0.6242282 1.5251396 debye
polarizability: 255.7862545|-28.6512018|180.0120927|15.6395422|-29.1661949|200.1273173 unknown
InChI: InChI=1S/C18H21NO2/c1-12(2)15-10-9-13(3)16(17(15)20)18(21)19-11-14-7-5-4-6-8-14/h4-10,12,19-20H,11H2,1-3H3
charge 0 multiplicity 1
42 atoms
O  -1.247911 -1.172464 0.472895
O  1.002713 0.571741 -2.602625
N  1.055212 -0.635921 -0.629231
C  -4.003914 -0.567301 1.046173
C  -3.22046 0.168232 -0.050663
C  -1.85349 -0.143632 -0.296205
C  -1.048279 0.525141 -1.271197
C  -1.660231 1.589124 -2.020698
C  -3.786168 1.206439 -0.818986
C  -5.537283 -0.509509 0.856577
C  -3.617904 -0.025858 2.455924
C  -3.018985 1.902576 -1.77196
C  0.397794 0.153529 -1.557775
C  -0.936866 2.415101 -3.070202
C  2.45565 -1.035931 -0.81477
C  3.313081 -0.775221 0.419948
C  3.216973 0.453731 1.122077
C  4.244738 -1.744843 0.866392
C  4.038636 0.708516 2.241539
C  5.070749 -1.491962 1.986011
C  4.970497 -0.26348 2.677878
H  -3.743124 -1.653234 1.009158
H  -4.835599 1.480258 -0.67249
H  -5.918433 0.518304 0.998241
H  -6.035132 -1.149784 1.606862
H  -5.837017 -0.855445 -0.148443
H  -2.527514 -0.056272 2.635435
H  -4.11813 -0.608257 3.251739
H  -3.93655 1.027939 2.550302
H  -3.481305 2.712469 -2.346463
H  0.008552 2.835017 -2.68795
H  -0.646862 1.799515 -3.937739
H  -1.589496 3.239638 -3.408691
H  2.823445 -0.458407 -1.684323
H  2.517028 -2.108776 -1.089393
H  0.508305 -1.033402 0.142566
H  -1.918481 -1.634813 1.032219
H  2.492797 1.204723 0.785716
H  4.324774 -2.702337 0.335787
H  3.955757 1.663699 2.772854
H  5.786371 -2.252374 2.319239
H  5.608165 -0.06607 3.546973
