program: Gaussian 09
title: 000239349
version: EM64L-G09RevD.01
frameworkgroup: C1[X(C4H2N4O3)]
method: RPBEPBE
basis: SDD
operation: Freq
keyword: #pfreq=noraman
keyword: PBEPBE/SDD
title: #p freq=noraman PBEPBE/SDD
converged: NO NO NO NO
title: Mulliken charges:
elementType: O O O N N N N C C C C H H
charge: -0.218892 -0.218873 -0.217535 -0.389895 -0.389925 0.060387 0.071162 -0.001703 0.176277 0.176295 0.194205 0.379250 0.379246
chargesum: 0.00000
title: Mulliken charges with hydrogens summed into heavy atoms:
elementType: O O O N N N N C C C C
charge: -0.218892 -0.218873 -0.217535 -0.010645 -0.010679 0.060387 0.071162 -0.001703 0.176277 0.176295 0.194205
polarizability: 1.36176310e+02 -1.65311910e-03 8.46839314e+01 -1.35202288e-03 -3.06300962e-04 3.18227425e+01
1716.lowfreq: -13.4262 -12.2838 -3.6830 -0.0011 -0.0008 0.0001 70.4905 116.0433 158.3914
frequency: 70.4823 116.0334 158.3910 160.7752 228.8214 322.0156 350.4511 407.6623 435.6447 500.8536 517.9267 594.0766 615.1522 660.6595 667.7593 725.8970 727.5913 732.6928 772.5493 979.5538 1093.2766 1203.5938 1220.7445 1365.8506 1370.9596 1373.3188 1373.3364 1622.0102 1640.4998 1684.7216 2092.8548 3532.2293 3534.0327
redmass: 14.7013 13.6338 13.8483 5.9458 9.3371 14.3692 13.3753 13.9470 13.8262 8.8394 12.2902 12.5541 2.4856 5.5143 1.8512 1.8395 5.3824 7.2723 2.7657 3.6515 6.6139 12.3321 6.3564 11.0605 2.0139 1.4419 6.5039 7.1149 8.7069 5.7918 13.9432 1.0762 1.0785
irintensity: 0.4952 0.0481 9.8449 0.0005 0.4637 17.5069 18.6107 7.1895 1.1002 30.7841 1.5236 4.5366 0.0000 2.5011 58.6749 0.0002 14.3251 18.8370 229.4482 0.8095 0.2267 26.8865 83.8989 197.9263 124.1147 35.3665 432.7591 635.5914 27.7080 586.1821 372.5215 117.0613 63.2882
temp: 298.150 k
press: 1.00000 atm
elementType: 8 8 8 7 7 7 7 6 6 6 6 1 1
symmnumber: 1
zpe: 196501.1 jmol-1
zpe.correction: 0.074843 hartree
zpe.thermalcorrener: 0.083812 hartree
zpe.thermalcorrenthalpy: 0.084757 hartree
zpe.thermalcorrgfe: 0.040168 hartree
zpe.sumelectzpe: -597.531067 hartree
zpe.sumelectthermal: -597.522098 hartree
zpe.sumelectthermalent: -597.521154 hartree
zpe.sumelectthermalfe: -597.565742 hartree
dipole: -0.0076 0.0002 0.0002
dipole: 0.0077
quadrupole: -71.3338 -69.9925 -59.9226
quadrupole: -0.0004 0.0000 0.0005
quadrupole: -4.2508 -2.9095 7.1604 -0.0004 0.0000 0.0005
hfenergy: -597.6059102 hartree
pointgroup: C01 [X(C4H2N4O3)]
dipole: -0.0030068 -0.0001478 -0.0000909 debye
dipolederiv: -0.5374272 -0.2928368 -0.0001234 -0.0822298 -1.0971187 -0.0003192 -0.000009 -0.0002971 -0.3471774 -0.5521783 0.313185 0.0001706 0.1025484 -1.0824015 -0.000382 -0.000007 -0.0001968 -0.347162 -1.3784636 -0.0153077 0.0000102 -0.0152426 -0.557566 -0.0000815 0.0000233 -0.0000898 -0.3703765 -1.2901744 -0.4988888 -0.0001976 -0.3848036 -0.7807406 -0.0001732 -0.0001533 -0.0001753 -0.3588201 -1.3224231 0.4786818 0.0001845 0.3646685 -0.7485601 -0.0001813 0.0002116 -0.0001971 -0.3588564 2.0154844 0.0415204 -0.0000003 0.0414993 -0.203693 -0.000181 0.0002227 -0.0001742 0.1935676 -1.0540676 -0.0207914 0.0000428 -0.0207216 0.0558177 0.0000267 -0.0001845 0.0000264 -0.0066812 -1.387908 -0.012082 -0.0000539 -0.012124 -0.7435741 -0.0002496 -0.0000881 -0.0003155 -0.1100349 1.6056724 0.2150855 0.0000824 -0.406545 1.5458451 0.0005133 -0.0002309 0.0005128 0.3138301 1.5985783 -0.2131189 -0.0000973 0.4084797 1.5530936 0.0005942 0.0002408 0.0004598 0.3138557 1.9411367 0.006497 -0.0000293 0.006412 1.5928014 0.0005406 -0.0000286 0.0005407 0.3688269 0.183397 -0.0538723 -0.0000217 -0.0826414 0.2305367 -0.0000541 -0.000036 -0.0000503 0.3545108 0.1783734 0.0519282 0.000033 0.0807001 0.2355596 -0.0000527 0.0000389 -0.0000437 0.3545175 unknown
polarizability: 136.1583498|0.9615181|84.7018831|0.0024112|0.0218847|31.8227515 unknown
InChI: InChI=1S/C4H2N4O3/c5-8-1-2(9)6-4(11)7-3(1)10/h6-7H
charge 0 multiplicity 1
13 atoms
O  0.656724 2.446631 0.001007
O  0.747469 -2.419143 -0.000961
O  -3.293291 -0.06065 0.000032
N  -1.29826 1.160475 0.000494
N  -1.254159 -1.206743 -0.000526
N  2.149616 0.040816 -0.000005
N  3.317375 0.062606 0.000183
C  0.816242 0.015853 -0.000021
C  0.107057 1.314656 0.000566
C  0.156013 -1.308433 -0.00068
C  -2.041185 -0.037394 0.000002
H  -1.848784 2.024853 0.000862
H  -1.772121 -2.091028 -0.000853
