program: Gaussian 09
title: 000239340
version: EM64L-G09RevD.01
frameworkgroup: C1[X(C12H14ClNO4)]
method: RPBEPBE
basis: SDD
operation: Freq
keyword: #p
keyword: freq=noraman
keyword: PBEPBE/SDD
title: #p freq=noraman PBEPBE/SDD
converged: YES YES NO NO
title: Mulliken charges:
elementType: Cl O O O O N C C C C C C C C C C C C H H H H H H H H H H H H H H
charge: -0.073947 -0.279766 -0.240443 -0.202213 -0.193348 0.023516 -0.366108 -0.373205 -0.316445 -0.310059 -0.601658 0.248893 0.198753 -0.458855 -0.337610 0.382547 -0.179970 -0.349411 0.194804 0.204854 0.239193 0.213755 0.227498 0.222737 0.228507 0.235198 0.262324 0.259373 0.322627 0.281291 0.245072 0.292094
chargesum: 0.00000
title: Mulliken charges with hydrogens summed into heavy atoms:
elementType: Cl O O O O N C C C C C C C C C C C C
charge: -0.073947 -0.279766 -0.240443 -0.202213 -0.193348 0.023516 0.033550 0.079744 0.133790 0.153647 -0.079961 0.248893 0.198753 -0.136228 -0.056319 0.382547 0.065102 -0.057316
polarizability: 2.36841980e+02 -1.01770425e+01 1.50403737e+02 -1.74737759e+01 -1.74990183e+01 1.12334326e+02
1716.lowfreq: -6.6071 -0.0925 -0.0026 -0.0019 -0.0011 5.7933 14.7110 21.8612 42.1414
frequency: 14.5324 21.8444 42.1118 46.5435 53.9645 67.2584 96.7725 112.5683 124.9747 133.3959 154.9169 171.4300 186.6875 237.5651 259.3628 306.4125 325.8403 383.6098 409.6229 422.9830 443.6144 470.7396 494.2489 538.8872 644.0307 654.9969 678.4680 685.9165 696.0408 739.4828 745.3691 748.9207 773.2815 818.4773 830.1334 839.8454 923.5682 950.1924 965.0316 976.0302 989.4037 1012.1272 1016.1205 1029.3286 1068.6003 1070.0982 1074.4751 1082.2947 1086.0723 1094.3812 1172.4459 1176.5403 1212.0764 1228.6103 1237.3376 1241.8483 1278.1225 1279.8383 1282.4279 1293.4876 1297.9956 1329.7284 1355.7270 1374.5541 1376.9872 1401.6427 1433.1466 1453.9906 1457.3209 1470.2079 1471.4006 1474.9101 1488.5998 1584.6564 1613.4386 1627.2335 2963.5425 2995.9225 3000.2337 3011.2927 3024.1577 3047.3005 3054.0679 3065.2490 3104.9281 3129.8110 3156.8113 3180.3276 3181.6152 3189.8222
redmass: 9.3802 8.4625 2.2788 6.6962 11.3324 3.8837 5.3037 3.3464 2.2302 2.7970 5.9744 7.1999 5.0543 4.9927 4.9231 7.9092 4.2424 8.3206 3.6208 3.2655 5.5716 6.2004 7.1964 5.6847 6.9294 5.8342 7.1258 6.3152 2.4493 6.5492 1.1893 2.4896 1.3269 3.5261 1.5036 1.5897 6.6881 1.2830 1.4113 1.4422 6.2692 1.3666 4.8993 4.4015 1.1942 2.4307 2.0084 2.3626 2.0080 4.3726 1.2600 1.4086 6.8527 1.2070 1.3711 3.7604 1.2157 1.1699 1.3583 1.0841 1.1133 1.3129 1.4954 2.0698 2.9234 8.5244 2.9911 1.1171 1.0986 1.1533 2.2014 1.1085 1.1006 7.2941 7.1535 9.8922 1.0587 1.0601 1.0606 1.0993 1.0578 1.0565 1.1033 1.1043 1.1085 1.1114 1.0887 1.0924 1.0927 1.0985
irintensity: 1.6287 0.6723 1.8585 0.6239 0.4438 0.8339 1.6974 0.5522 0.1137 0.0680 1.7017 0.4743 1.1735 5.2794 4.9252 4.2816 19.4320 1.5258 1.9017 0.6723 5.7844 1.7723 3.5102 1.3612 3.8114 4.8130 51.1454 14.7841 57.7962 11.3383 23.2733 7.0430 4.3787 0.2067 27.0748 0.5962 50.7822 1.8562 0.5156 16.9962 1.7532 0.8512 19.1923 2.5923 6.1075 2.3764 64.9365 219.6575 51.2628 49.8941 58.5840 0.1112 427.9765 7.1998 16.9848 97.1283 21.5563 9.0182 20.7356 3.8052 0.5199 8.7513 2.6559 34.0247 74.5876 0.9481 19.1316 18.0184 3.1307 3.2715 10.2626 0.4952 22.3413 23.2716 24.3943 126.0993 24.5973 1.6336 27.1106 11.5812 45.7074 30.3350 0.2141 36.9066 23.5072 26.2536 7.2690 5.8870 3.4790 5.2930
temp: 298.150 k
press: 1.00000 atm
elementType: 17 8 8 8 8 7 6 6 6 6 6 6 6 6 6 6 6 6 1 1 1 1 1 1 1 1 1 1 1 1 1 1
symmnumber: 1
zpe: 642585.6 jmol-1
zpe.correction: 0.244748 hartree
zpe.thermalcorrener: 0.262913 hartree
zpe.thermalcorrenthalpy: 0.263857 hartree
zpe.thermalcorrgfe: 0.193853 hartree
zpe.sumelectzpe: -1279.965930 hartree
zpe.sumelectthermal: -1279.947765 hartree
zpe.sumelectthermalent: -1279.946820 hartree
zpe.sumelectthermalfe: -1280.016824 hartree
dipole: -2.0449 6.1523 -0.0014
dipole: 6.4832
quadrupole: -152.0082 -114.6010 -112.3114
quadrupole: 9.9276 -15.7402 -0.8537
quadrupole: -25.7013 11.7059 13.9955 9.9276 -15.7402 -0.8537
hfenergy: -1280.2106775 hartree
pointgroup: C01 [X(C12H14Cl1N1O4)]
dipole: 0.9259126 -0.8793712 2.2080383 debye
polarizability: 237.488271|13.762803|130.2623243|11.8035191|-26.0693205|131.8294482 unknown
InChI: InChI=1S/C12H14ClNO4/c13-7-2-1-3-8-18-12(15)10-5-4-6-11(9-10)14(16)17/h4-6,9H,1-3,7-8H2
charge 0 multiplicity 1
32 atoms
Cl 8.045041 -0.375782 -2.038011
O  0.894807 -0.056436 1.244409
O  0.291522 1.503779 -0.386034
O  -5.816173 -0.349556 -1.34733
O  -4.385919 1.243609 -2.133475
N  -4.6678 0.239396 -1.376034
C  4.601989 0.486183 0.27642
C  3.168722 -0.093996 0.215923
C  5.527382 -0.161894 -0.784406
C  2.266958 0.536258 1.285848
C  6.931733 0.440829 -0.741336
C  -1.333497 -0.150175 0.372756
C  0.001031 0.526353 0.345092
C  -2.340713 0.347088 -0.487174
C  -1.603179 -1.254659 1.222343
C  -3.60136 -0.277034 -0.474589
C  -2.878423 -1.861196 1.213759
C  -3.893336 -1.376857 0.362415
H  5.028121 0.327496 1.288757
H  4.562027 1.582961 0.11518
H  2.734637 0.097108 -0.783083
H  3.200783 -1.190687 0.36216
H  5.096854 -0.017831 -1.793267
H  5.590052 -1.253024 -0.611668
H  2.618228 0.310431 2.306135
H  2.182193 1.628421 1.141346
H  6.939486 1.513344 -0.990275
H  7.438327 0.268721 0.221196
H  -2.139781 1.197424 -1.1449
H  -0.810902 -1.623056 1.879184
H  -3.082696 -2.71217 1.870709
H  -4.890116 -1.824749 0.332751
