program: Gaussian 09
title: 000239330
version: EM64L-G09RevD.01
frameworkgroup: C1[X(C15H21ClN2O3)]
method: RPBEPBE
basis: SDD
operation: Freq
keyword: #p
keyword: freq=noraman
keyword: PBEPBE/SDD
title: #p freq=noraman PBEPBE/SDD
converged: YES YES NO NO
title: Mulliken charges:
elementType: Cl O O O N N C C C C C C C C C C C C C C C H H H H H H H H H H H H H H H H H H H H H
charge: -0.061870 -0.464080 -0.294896 -0.318870 -0.099012 -0.464134 -0.358415 -0.364509 -0.394723 -0.390319 -0.398484 -0.375227 -0.086029 -0.331544 0.316649 0.499877 -0.436500 -0.362809 -0.043450 -0.186081 -0.254584 0.209028 0.177712 0.174839 0.212315 0.194587 0.202481 0.201198 0.193808 0.191224 0.214833 0.209548 0.225065 0.202277 0.232148 0.256796 0.375775 0.339606 0.254503 0.306603 0.235259 0.259405
chargesum: 0.00000
title: Mulliken charges with hydrogens summed into heavy atoms:
elementType: Cl O O O N N C C C C C C C C C C C C C C C
charge: -0.061870 -0.088306 -0.294896 -0.318870 -0.099012 -0.124528 0.028325 0.022645 0.002346 0.004687 0.007573 0.059387 0.116248 0.157400 0.316649 0.499877 -0.181997 -0.056206 -0.043450 0.049177 0.004821
polarizability: 2.89799430e+02 1.13249638e+01 1.92459014e+02 1.57686682e+01 -9.55857893e+00 1.25278420e+02
1716.lowfreq: -0.0016 -0.0004 0.0013 0.6536 4.1452 15.0995 20.5977 31.6266 34.6600
frequency: 20.2507 29.0898 33.9456 40.8082 62.0577 81.5612 90.3667 118.0328 131.0805 146.8157 184.0337 222.7072 241.0242 248.6803 252.1054 266.0905 281.7068 311.4303 329.9043 358.8762 369.9398 391.7081 413.0958 433.3530 439.2005 453.4171 474.6376 511.0833 559.7999 576.5767 628.5931 646.5863 652.9385 664.0499 684.6895 696.9029 711.9183 764.1185 790.2878 804.4029 831.0460 853.3641 853.4589 856.4483 864.1025 896.3449 906.8534 910.5904 919.1569 956.9481 979.3740 989.7512 992.2401 1019.4288 1036.0616 1051.1858 1067.5669 1074.4979 1082.5120 1094.7859 1098.1451 1118.0440 1124.3878 1151.8080 1158.2640 1180.1194 1182.8343 1185.1254 1238.3602 1248.6753 1253.5102 1265.2408 1269.0693 1278.4656 1293.2433 1307.8845 1314.6465 1328.8466 1336.1381 1341.6157 1347.2129 1351.1854 1364.7113 1378.0959 1387.7574 1413.1961 1416.5458 1441.0508 1452.1057 1460.9638 1461.5953 1467.7951 1471.9416 1474.8461 1480.9483 1520.4721 1588.1859 1613.2046 1643.5037 2830.9288 2840.1302 2913.0724 2941.1428 2967.7307 2983.3980 2984.5878 3014.1211 3020.0099 3031.7508 3034.7157 3037.4189 3044.3873 3053.6198 3108.7642 3147.0022 3149.1599 3180.3449 3198.6163 3374.1753 3540.7336
redmass: 5.7656 4.9775 3.5877 5.1252 5.5538 8.7134 5.5108 3.5685 4.1875 7.6923 5.4241 3.3033 1.9542 5.7206 4.5996 3.1425 4.1934 3.6753 2.4739 4.0012 4.4329 2.1317 7.0648 2.8297 3.0480 2.8508 2.4845 4.0517 4.3046 2.0706 5.0671 1.3309 1.5176 3.3005 2.3132 6.2787 3.8829 3.5877 1.3194 1.4907 2.4662 4.8807 1.5033 2.7024 1.5729 4.2898 2.6903 1.3655 2.2629 1.3065 5.9583 1.3147 2.5600 6.5873 2.2310 2.0578 2.6145 2.0132 2.4583 1.5530 1.5366 2.3514 2.5807 1.3018 2.3898 1.2276 2.1652 1.3477 1.2351 1.8002 1.3597 1.2792 1.3089 1.1274 1.4068 1.4859 1.2822 1.2622 1.3016 1.4244 1.4554 1.3955 1.4041 5.7642 1.4031 2.2676 1.8192 1.1096 1.0919 1.0879 1.0825 1.0891 1.0852 2.5786 1.0972 2.3424 5.0198 6.3297 7.2625 1.0716 1.0700 1.0682 1.0826 1.0626 1.0616 1.0614 1.0605 1.0885 1.0924 1.0911 1.0907 1.1032 1.1037 1.1055 1.0925 1.0891 1.0955 1.0955 1.0661 1.0762
irintensity: 0.0148 0.3004 0.1569 2.1023 0.6154 2.3273 0.2578 1.4259 0.8122 3.8715 0.3783 3.4493 0.5683 4.7428 3.6658 4.0466 27.7820 2.2343 6.0109 8.6800 3.4178 8.7004 6.3045 9.6999 7.2364 0.2708 1.4795 4.4664 2.0723 6.0930 8.6487 112.2299 2.8643 17.5899 34.2679 15.8837 93.8182 10.5218 59.2221 0.4767 14.8357 73.8486 5.3878 18.3984 48.7408 9.5810 6.0415 4.3752 6.6964 3.2427 10.2676 3.7072 48.8931 136.7578 13.8548 18.6185 65.3130 21.6662 51.6586 5.3104 27.9013 26.4354 3.6839 4.5182 40.3538 79.1218 410.1736 20.2569 11.6705 12.4269 12.8305 7.0527 16.7352 32.7406 13.8976 18.8737 42.2605 11.6287 17.6690 0.3879 3.6996 2.0568 14.8885 94.4714 11.1506 203.4506 25.5760 13.7017 7.1879 13.9189 6.9694 7.7066 4.6950 98.4192 8.6747 458.8262 183.0074 175.7301 206.4629 42.3157 164.2549 75.9941 41.1469 39.5680 30.9618 28.1463 15.2812 40.7746 72.3485 67.2049 26.0534 19.9129 104.3367 3.2504 6.3305 6.6838 2.3412 6.2718 394.6714 34.6833
temp: 298.150 k
press: 1.00000 atm
elementType: 17 8 8 8 7 7 6 6 6 6 6 6 6 6 6 6 6 6 6 6 6 1 1 1 1 1 1 1 1 1 1 1 1 1 1 1 1 1 1 1 1 1
symmnumber: 1
zpe: 904132.4 jmol-1
zpe.correction: 0.344366 hartree
zpe.thermalcorrener: 0.364726 hartree
zpe.thermalcorrenthalpy: 0.365671 hartree
zpe.thermalcorrgfe: 0.292796 hartree
zpe.sumelectzpe: -1377.829514 hartree
zpe.sumelectthermal: -1377.809153 hartree
zpe.sumelectthermalent: -1377.808209 hartree
zpe.sumelectthermalfe: -1377.881083 hartree
dipole: -1.5374 1.9848 -0.8467
dipole: 2.6496
quadrupole: -126.9076 -138.6021 -132.5839
quadrupole: -12.3980 3.1571 1.0223
quadrupole: 5.7903 -5.9043 0.1140 -12.3980 3.1571 1.0223
hfenergy: -1378.1738794 hartree
pointgroup: C01 [X(C15H21Cl1N2O3)]
dipole: 0.6376109 -0.745112 0.3533926 debye
polarizability: 288.9931984|-1.310153|163.6684345|-21.1328448|-35.1284709|154.8752317 unknown
InChI: InChI=1S/C15H21ClN2O3/c16-12-5-4-6-13(9-12)17-15(20)21-11-14(19)10-18-7-2-1-3-8-18/h4-6,9,14,17,19H,1-3,7-8,10-11H2
charge 0 multiplicity 1
42 atoms
Cl -6.806502 -1.795976 1.764621
O  1.456156 1.995024 -1.634292
O  0.157387 -0.85071 -0.438734
O  -1.061619 0.884954 -1.468794
N  4.219406 -0.016527 -0.125282
N  -2.065053 -0.752968 -0.088706
C  4.365073 0.475074 1.271237
C  5.535778 -0.416545 -0.692167
C  4.983014 -0.606116 2.181015
C  6.191457 -1.526452 0.154059
C  6.346245 -1.075376 1.624292
C  3.499423 0.941049 -0.996615
C  1.966475 0.915975 -0.792281
C  1.40982 -0.468344 -1.170737
C  -1.006134 -0.142887 -0.734792
C  -3.42751 -0.34668 -0.06622
C  -4.318687 -1.134709 0.711523
C  -3.911799 0.783646 -0.776254
C  -5.674385 -0.773622 0.762405
C  -5.281668 1.110382 -0.694725
C  -6.186594 0.341353 0.072729
H  3.369885 0.765192 1.654119
H  5.009674 1.393491 1.300899
H  6.233945 0.460261 -0.747763
H  5.373873 -0.772834 -1.726849
H  5.097164 -0.201543 3.205151
H  4.288563 -1.467023 2.236049
H  5.555037 -2.431772 0.109598
H  7.175609 -1.786268 -0.28131
H  7.072582 -0.237735 1.677026
H  6.756157 -1.89699 2.241552
H  3.702037 0.683639 -2.053855
H  3.830673 1.996235 -0.853821
H  1.722645 1.099485 0.278049
H  1.21547 -0.523635 -2.258519
H  2.121393 -1.244714 -0.847496
H  0.467531 1.862454 -1.720693
H  -1.812827 -1.589452 0.442932
H  -3.960931 -2.009513 1.265135
H  -3.223449 1.382349 -1.374579
H  -5.654996 1.982458 -1.241798
H  -7.247221 0.598474 0.131294
