program: Gaussian 09
title: 000239326
version: EM64L-G09RevD.01
frameworkgroup: C1[X(C14H18ClNO3)]
method: RPBEPBE
basis: SDD
operation: Freq
keyword: #p
keyword: freq=noraman
keyword: PBEPBE/SDD
title: #p freq=noraman PBEPBE/SDD
converged: YES YES NO NO
title: Mulliken charges:
elementType: Cl O O O N C C C C C C C C C C C C C C H H H H H H H H H H H H H H H H H H
charge: -0.075631 -0.282554 -0.258559 -0.241858 -0.443632 -0.330063 -0.356174 -0.347923 -0.314770 -0.695232 0.270615 0.169042 -0.450803 0.505136 -0.379230 -0.449451 -0.189581 0.243049 -0.669016 0.202856 0.195597 0.215930 0.192757 0.194913 0.189902 0.235885 0.224540 0.211511 0.211653 0.214604 0.341370 0.275890 0.232666 0.234772 0.323406 0.299099 0.299284
chargesum: 0.00000
title: Mulliken charges with hydrogens summed into heavy atoms:
elementType: Cl O O O N C C C C C C C C C C C C C C
charge: -0.075631 -0.282554 -0.258559 -0.241858 -0.120226 0.068390 0.052513 0.036892 0.145655 -0.057464 0.270615 0.169042 -0.109433 0.505136 -0.103340 -0.216784 0.045191 0.243049 -0.070633
polarizability: 2.33533770e+02 1.01136340e+01 1.89301949e+02 -2.26487147e+01 2.93512330e+01 1.29903437e+02
1716.lowfreq: -8.0747 -3.2713 0.0004 0.0011 0.0012 4.1790 9.9730 23.3649 30.2197
frequency: 9.2592 23.2790 30.0833 36.1574 49.6248 65.6987 77.8513 89.4521 96.7828 120.2971 126.6882 155.6435 175.1171 203.8938 229.8926 262.2144 280.1727 310.5986 339.9836 349.8762 370.0393 390.9556 430.6580 451.3444 468.6860 508.0113 525.5462 576.9949 645.2478 669.8121 681.3418 690.2357 722.5300 724.1866 741.9743 758.1717 773.1804 822.8384 842.1831 860.5740 904.8522 919.0344 927.2380 930.0867 941.6046 953.2765 968.9818 986.9115 995.2598 1017.2544 1053.2323 1060.9824 1086.8238 1104.2722 1117.7388 1150.1320 1150.7229 1180.3599 1188.7384 1213.2135 1234.3547 1237.1301 1256.9220 1272.6898 1279.2245 1285.3530 1293.3462 1299.7332 1338.5832 1358.9021 1364.7881 1390.2153 1395.5327 1417.6643 1437.1725 1448.4852 1461.0302 1465.5059 1472.2479 1475.4837 1477.4807 1486.2423 1541.1303 1595.6285 1610.9635 1612.6688 1624.6979 2962.2795 2969.1772 2973.6360 2977.1937 3003.0073 3016.3144 3025.7533 3048.3196 3070.4507 3070.7205 3072.3280 3093.5384 3121.1867 3152.2923 3152.8620 3173.7633 3207.2952 3456.7881
redmass: 4.4641 5.4061 5.3162 1.8698 8.1960 4.1481 3.5691 3.7120 3.6493 7.5089 2.6646 3.4356 4.5648 4.6049 1.1406 3.8839 4.2345 3.8738 6.1729 5.7182 6.8723 2.9995 3.3129 5.1877 4.6321 3.5332 3.6978 3.7357 6.5805 6.2275 6.6027 2.5654 1.7131 1.1699 1.6723 4.0325 1.5034 1.6314 3.1087 1.6363 1.7251 1.7647 4.2089 1.4286 2.6161 2.6575 1.4177 6.2027 1.3525 1.9788 2.5619 3.0748 2.0710 1.5856 2.2679 2.0879 1.1115 1.1571 2.2729 1.4034 1.2862 2.6113 1.1993 1.2193 2.5851 1.2164 1.0774 1.3859 1.4324 1.4226 1.4882 1.2190 8.3979 1.1429 3.2320 1.0816 1.1090 1.0720 2.4349 1.0691 1.0425 1.0789 2.0804 7.1838 7.0475 5.2404 8.2903 1.0587 1.0602 1.0368 1.0601 1.0979 1.0731 1.0853 1.1022 1.0565 1.1007 1.0994 1.1086 1.0895 1.0911 1.1095 1.0978 1.0930 1.0764
irintensity: 0.0274 0.4761 0.0433 0.5942 4.4722 0.3515 14.1576 1.2222 0.0714 2.0888 0.2204 1.2478 1.3489 2.5759 0.1354 0.6082 2.8802 14.2208 6.6945 1.1115 8.9860 3.5331 1.8422 17.2241 9.8843 0.6444 10.6488 3.9624 0.3409 1.4143 103.8962 11.4031 4.4937 8.1323 89.8389 4.3787 1.3265 53.3879 2.9994 2.4090 12.0547 3.8312 6.2949 1.6676 1.5563 46.4599 23.6137 5.6507 1.2330 8.4795 19.1574 214.0938 2.1251 1.7807 4.9453 1.1992 0.4068 49.1526 136.0621 1.2531 3.3639 122.8359 22.1440 0.9441 91.0646 13.0362 0.8802 6.5780 2.3003 7.5139 3.4878 11.1482 48.0224 44.4015 68.5137 5.1598 36.4899 1.2155 6.5534 2.8131 11.8185 15.2148 391.8349 285.6484 130.4113 5.8346 44.5224 17.3669 4.3736 27.7818 83.4052 4.6517 29.5747 10.0957 60.9943 3.1764 88.6180 57.1160 18.4450 10.8714 9.9727 0.6510 9.0447 9.6727 83.0667
temp: 298.150 k
press: 1.00000 atm
elementType: 17 8 8 8 7 6 6 6 6 6 6 6 6 6 6 6 6 6 6 1 1 1 1 1 1 1 1 1 1 1 1 1 1 1 1 1 1
symmnumber: 1
zpe: 778875.9 jmol-1
zpe.correction: 0.296658 hartree
zpe.thermalcorrener: 0.316812 hartree
zpe.thermalcorrenthalpy: 0.317756 hartree
zpe.thermalcorrgfe: 0.242954 hartree
zpe.sumelectzpe: -1283.371670 hartree
zpe.sumelectthermal: -1283.351516 hartree
zpe.sumelectthermalent: -1283.350572 hartree
zpe.sumelectthermalfe: -1283.425374 hartree
dipole: -1.7570 -0.5247 0.6951
dipole: 1.9610
quadrupole: -112.8771 -117.9249 -118.5428
quadrupole: -9.2801 -4.3428 4.6154
quadrupole: 3.5712 -1.4766 -2.0945 -9.2801 -4.3428 4.6154
hfenergy: -1283.6683278 hartree
pointgroup: C01 [X(C14H18Cl1N1O3)]
dipole: 0.5939425 -0.4750448 -0.1297205 debye
polarizability: 224.3392092|-27.9670825|183.5796236|-21.2880902|-36.9355939|144.8203236 unknown
InChI: InChI=1S/C14H18ClNO3/c1-2-3-4-8-19-14(18)11-6-5-7-12(9-11)16-13(17)10-15/h5-7,9,16H,2-4,8,10H2,1H3
charge 0 multiplicity 1
37 atoms
Cl 5.442533 -3.283036 0.66789
O  -1.383442 0.791913 1.22461
O  -1.481729 2.730741 -0.080126
O  1.640878 -2.343684 1.808915
N  3.19027 -1.27912 0.378391
C  -3.919031 0.032612 -0.360018
C  -3.709681 -0.056581 1.167672
C  -4.8967 -1.039693 -0.891896
C  -2.771829 1.019121 1.730206
C  -5.099878 -0.956801 -2.420166
C  0.52617 1.344008 -0.109869
C  -0.860591 1.713245 0.318171
C  1.160597 0.174896 0.376285
C  2.474405 -0.126649 -0.05985
C  1.18402 2.206941 -1.02189
C  3.136991 0.737352 -0.973075
C  2.491305 1.896154 -1.448802
C  2.770466 -2.271131 1.236116
C  3.75675 -3.40616 1.536069
H  -2.942568 -0.080901 -0.871441
H  -4.294376 1.042148 -0.624402
H  -3.316398 -1.05649 1.437049
H  -4.685651 0.052508 1.685684
H  -4.516052 -2.04604 -0.622051
H  -5.875397 -0.929759 -0.38085
H  -3.088552 2.036388 1.437795
H  -2.681907 0.946626 2.827331
H  -5.509225 0.028626 -2.712306
H  -4.140407 -1.091297 -2.954253
H  -5.799348 -1.734114 -2.77907
H  0.644202 -0.48181 1.077027
H  0.660604 3.100317 -1.375548
H  4.154525 0.500821 -1.309222
H  3.011072 2.554404 -2.1524
H  4.142829 -1.393872 0.011392
H  3.32185 -4.364072 1.215784
H  3.973495 -3.428511 2.613943
