program: Gaussian 09
title: 000239320
version: EM64L-G09RevD.01
frameworkgroup: C1[X(C16H18Cl3NO)]
method: RPBEPBE
basis: SDD
operation: Freq
keyword: #p
keyword: freq=noraman
keyword: PBEPBE/SDD
title: #p freq=noraman PBEPBE/SDD
converged: YES YES NO NO
title: Mulliken charges:
elementType: Cl Cl Cl O N C C C C C C C C C C C C C C C C H H H H H H H H H H H H H H H H H H
charge: -0.057026 -0.073729 -0.054033 -0.474949 -0.132207 -0.451346 -0.186527 0.325767 -0.325473 -0.328526 0.213028 0.512712 -0.416064 -0.567715 -0.581423 -0.398977 -0.394659 -0.250777 -0.412815 -0.272564 -0.239128 0.234374 0.248131 0.206903 0.220993 0.237903 0.242246 0.224743 0.296767 0.266485 0.268654 0.269921 0.284059 0.221707 0.255684 0.365066 0.261647 0.228260 0.232888
chargesum: 0.00000
title: Mulliken charges with hydrogens summed into heavy atoms:
elementType: Cl Cl Cl O N C C C C C C C C C C C C C C C C
charge: -0.057026 -0.073729 -0.054033 -0.109884 -0.132207 0.031159 0.020377 0.325767 0.133423 0.138463 0.213028 0.512712 -0.119297 -0.032576 -0.027443 -0.177270 -0.394659 0.004907 -0.151167 -0.044304 -0.006241
polarizability: 2.75640572e+02 -9.36985233e-01 2.21880391e+02 -1.02812045e+01 3.71232471e+01 1.55205795e+02
1716.lowfreq: 0.0010 0.0013 0.0020 1.7552 7.5819 12.0209 16.8895 23.8704 26.6858
frequency: 16.7121 23.6974 26.6333 44.6721 56.9919 62.3832 87.3759 95.2567 118.9783 143.8562 162.8489 180.4196 193.4533 206.3233 214.0109 224.1835 263.9679 298.7182 320.4188 355.4055 378.7680 401.8575 412.0684 425.4985 459.9711 469.7100 484.2476 510.2888 518.4214 535.8951 575.2642 592.2889 605.9006 639.1927 651.1905 665.1417 737.7087 769.1428 775.5021 778.4505 786.7178 803.1578 846.1448 854.1146 877.0967 893.9207 908.0689 945.8223 961.5687 969.1970 993.1834 996.4472 1000.4276 1017.8674 1034.5659 1037.1005 1059.6873 1066.3816 1111.6198 1119.4456 1128.0421 1159.2014 1177.6261 1182.0873 1197.3589 1212.1396 1214.7812 1245.1615 1255.3856 1265.1167 1267.7584 1284.1833 1292.8825 1304.9623 1311.1819 1359.1461 1364.5123 1368.2743 1369.9780 1378.4949 1396.8834 1410.3108 1431.6227 1446.5743 1449.8508 1452.1279 1456.8379 1461.8757 1482.7887 1514.4660 1579.0978 1595.5873 1628.4326 2863.6607 2929.8456 2938.7302 2959.5175 3043.2014 3047.3811 3056.3259 3058.7739 3061.2126 3128.7075 3136.2634 3143.0264 3148.5867 3156.4879 3162.6434 3170.6883 3182.7167 3447.1893
redmass: 10.4141 8.2107 11.9600 7.0063 7.1935 6.3539 2.7227 3.3571 5.6315 4.0723 5.4717 4.8401 6.0675 5.6601 5.4777 3.3048 3.1159 6.6011 3.5944 4.2715 5.6910 2.7659 2.3108 3.1289 4.6961 3.0729 1.6262 2.9661 3.1640 4.4262 6.1162 3.3619 4.6385 4.0205 5.0873 6.0389 3.7727 1.5104 1.2423 2.3629 4.9033 2.6998 1.9636 1.7489 1.6543 2.2814 3.3958 2.1220 1.3687 1.4082 1.3401 3.1796 1.6931 2.3938 2.3328 2.2707 3.8078 3.5125 1.5972 1.7137 1.9395 1.5388 1.1655 1.2196 1.6595 1.4254 1.5607 1.1953 1.6023 1.3827 1.5460 1.2867 1.2731 1.2663 1.2608 1.5079 2.7707 1.3566 1.6480 1.3727 2.1886 3.5295 2.8649 1.0994 2.3444 1.1630 1.1023 1.0925 1.0818 3.8619 8.0462 6.1546 6.7826 1.0705 1.0802 1.0691 1.0655 1.0924 1.0863 1.0656 1.0899 1.0582 1.0848 1.1104 1.0888 1.1124 1.0948 1.0898 1.0995 1.0952 1.0643
irintensity: 0.1947 0.1207 0.6708 1.2166 3.8627 2.3225 1.2566 0.2163 0.5307 0.2054 4.3860 2.2167 1.0050 7.5165 1.8869 3.2434 3.7166 0.5893 21.0076 5.3853 16.7126 10.6192 6.3726 1.9287 2.5160 3.5891 48.7166 61.6997 58.8569 11.9599 9.2913 0.9457 26.1546 2.7696 10.8431 76.5259 16.3488 61.2374 16.9038 8.2369 0.8606 11.8593 18.3863 35.0556 5.6091 13.5179 44.4808 14.5467 1.1174 4.1185 0.9703 16.1759 21.3701 32.0881 7.5510 4.1559 11.5268 54.4361 60.4522 25.8149 4.6913 8.0037 3.5304 7.4291 18.8224 26.5169 8.0413 18.2116 13.6058 3.9763 20.2562 7.7042 17.4776 26.5393 9.4919 3.7713 3.4958 11.1287 41.7250 10.1964 11.8630 1.4638 5.2372 7.5929 8.3177 12.7201 10.5497 9.4063 16.1010 10.9320 13.3004 8.9128 0.9657 75.2334 38.4657 53.8912 40.4548 11.4919 9.2534 35.7118 22.2481 12.8209 1.1698 15.6650 19.0142 11.1844 23.0043 3.0587 20.8628 1.2495 102.2747
temp: 298.150 k
press: 1.00000 atm
elementType: 17 17 17 8 7 6 6 6 6 6 6 6 6 6 6 6 6 6 6 6 6 1 1 1 1 1 1 1 1 1 1 1 1 1 1 1 1 1 1
symmnumber: 1
zpe: 801767.4 jmol-1
zpe.correction: 0.305377 hartree
zpe.thermalcorrener: 0.326340 hartree
zpe.thermalcorrenthalpy: 0.327285 hartree
zpe.thermalcorrgfe: 0.251910 hartree
zpe.sumelectzpe: -2129.092977 hartree
zpe.sumelectthermal: -2129.072014 hartree
zpe.sumelectthermalent: -2129.071070 hartree
zpe.sumelectthermalfe: -2129.146444 hartree
dipole: -1.9479 -4.4033 -3.4484
dipole: 5.9224
quadrupole: -153.0348 -142.4508 -151.6657
quadrupole: 8.9458 1.5208 11.7461
quadrupole: -3.9844 6.5996 -2.6153 8.9458 1.5208 11.7461
hfenergy: -2129.3983544 hartree
pointgroup: C01 [X(C16H18Cl3N1O1)]
dipole: -0.7937695 1.9241706 1.0471806 debye
polarizability: 275.3869424|2.7537503|232.1310621|11.0490549|24.4866811|145.208753 unknown
InChI: InChI=1S/C16H18Cl3NO/c17-7-9-20(10-8-18)11-16(21)14-5-6-15(19)13-4-2-1-3-12(13)14/h1-6,16,21H,7-11H2
charge 0 multiplicity 1
39 atoms
Cl -3.961429 1.378262 -2.309652
Cl -5.043159 -3.025139 1.451379
Cl 5.214267 -2.039238 -0.090425
O  -1.269196 -0.824622 -1.63506
N  -2.743717 0.293389 0.502941
C  -1.292567 0.057911 0.657065
C  -0.56414 0.076786 -0.727884
C  0.880689 -0.384508 -0.595694
C  -3.167567 1.695926 0.384337
C  -3.633802 -0.604905 1.270462
C  1.899012 0.489633 -0.060308
C  3.258031 -0.005774 0.109076
C  1.21688 -1.689309 -0.969498
C  -4.371164 1.9074 -0.539289
C  -3.942775 -1.86023 0.439534
C  1.635607 1.853312 0.310199
C  3.524104 -1.358714 -0.282613
C  2.544531 -2.18819 -0.815884
C  4.264279 0.861335 0.646857
C  2.636741 2.678453 0.825567
C  3.962599 2.176412 1.00192
H  -0.816377 0.78499 1.351397
H  -1.149685 -0.949512 1.086863
H  -0.598188 1.109884 -1.140258
H  -3.445417 2.137906 1.374989
H  -2.318724 2.289724 -0.00004
H  -3.186306 -0.903465 2.241893
H  -4.581198 -0.084999 1.503911
H  0.441331 -2.323877 -1.405177
H  -5.245139 1.302133 -0.254357
H  -4.647844 2.970962 -0.605181
H  -4.507142 -1.622672 -0.474146
H  -3.037518 -2.435394 0.195342
H  0.63059 2.264192 0.169079
H  2.787143 -3.211181 -1.116574
H  -2.220257 -0.522326 -1.627563
H  5.278728 0.47067 0.77046
H  2.409637 3.716548 1.091854
H  4.742345 2.828328 1.409879
