program: Gaussian 09
title: 000239310
version: EM64L-G09RevD.01
frameworkgroup: C1[X(C19H34N2O)]
method: RPBEPBE
basis: SDD
operation: Freq
keyword: #p
keyword: freq=noraman
keyword: PBEPBE/SDD
title: #p freq=noraman PBEPBE/SDD
converged: YES YES NO NO
title: Mulliken charges:
elementType: O N N C C C C C C C C C C C C C C C C C C C H H H H H H H H H H H H H H H H H H H H H H H H H H H H H H H H H H
charge: -0.322955 -0.432469 -0.145257 -0.027552 -0.492310 -0.428853 0.006399 -0.102352 -0.403816 -0.384354 -0.377262 -0.433451 -0.425818 -0.422188 -0.429132 -0.390225 -0.385850 -0.388625 -0.381295 -0.385042 -0.381689 0.214257 0.246610 0.208999 0.209703 0.242193 0.186075 0.168445 0.198121 0.203327 0.187719 0.197029 0.198967 0.198226 0.190965 0.187919 0.217335 0.227966 0.196992 0.194403 0.179081 0.216574 0.185079 0.220083 0.195903 0.197129 0.214890 0.215730 0.183640 0.183364 0.209592 0.184855 0.202087 0.182076 0.190770 0.297990
chargesum: 0.00000
title: Mulliken charges with hydrogens summed into heavy atoms:
elementType: O N N C C C C C C C C C C C C C C C C C C C
charge: -0.322955 -0.134479 -0.145257 0.219058 -0.073608 -0.000585 0.174844 0.095769 -0.012770 0.011642 0.011929 -0.028197 -0.000860 -0.048703 -0.027479 0.025761 0.026169 0.010745 0.011661 0.001900 -0.008843 0.214257
polarizability: 2.36153408e+02 -5.04974531e+00 2.29973415e+02 3.00017235e+00 -4.07826842e+00 1.86969037e+02
1716.lowfreq: -27.2893 -10.1149 -0.0005 -0.0004 -0.0004 3.3126 10.2491 17.8210 31.7095
frequency: -23.7335 13.6493 31.2995 39.8047 45.3919 64.4368 80.2353 106.0054 115.5573 136.2289 154.1645 191.2630 209.4572 212.3735 233.2467 265.8740 279.2518 284.1257 337.3968 354.2672 359.0727 369.2868 381.3012 391.8824 400.9951 447.3980 454.3240 458.5043 465.5855 471.5339 489.7560 527.5265 569.1299 608.6140 664.8200 671.7111 676.7331 767.2603 775.7989 776.6057 778.1781 794.7358 798.1129 808.4314 829.1093 840.6539 858.5653 863.3163 863.6268 864.1093 868.7496 872.2197 882.1980 909.6602 923.3487 929.4654 930.7425 985.7234 997.1986 1007.8266 1011.6839 1014.2830 1044.2812 1045.8027 1047.4233 1052.0625 1053.1104 1054.9073 1084.8941 1085.9759 1088.4060 1112.5068 1113.7021 1114.9355 1118.8895 1134.5161 1146.4861 1155.0802 1162.8422 1168.4425 1205.9775 1232.9926 1240.7227 1245.8284 1255.3084 1257.1706 1257.7394 1267.1877 1269.0151 1272.2405 1298.7572 1301.0295 1308.8415 1317.9363 1322.5115 1323.7064 1328.1553 1330.0861 1330.9985 1337.1713 1337.7479 1339.8326 1347.6853 1351.7583 1352.7899 1353.4445 1353.5293 1356.7819 1358.9215 1361.6469 1371.4937 1445.2423 1448.0321 1451.5970 1455.6369 1457.0657 1458.7340 1459.0279 1461.5319 1463.3987 1464.4575 1465.0208 1467.7967 1471.6915 1473.1428 1475.1062 1479.5175 1662.3745 2935.3134 2950.4386 2953.4450 2959.8038 2962.3538 2963.5046 2963.6541 2970.4856 2970.5959 2972.1184 2972.4612 2974.0777 2979.2351 2982.3840 2983.0870 2986.4725 2989.6647 2991.7064 3018.1679 3023.4117 3026.6614 3027.9704 3029.6142 3033.3972 3033.5123 3034.4532 3040.9862 3041.2130 3043.7927 3047.0792 3049.0642 3056.5560 3056.7300 3554.8061
redmass: 3.2254 3.4352 3.2916 3.7435 3.7606 3.3453 3.8447 3.3641 3.3692 3.2091 3.0503 2.4148 3.8423 2.4013 2.3879 2.2036 2.1671 2.3028 1.9989 1.3659 1.7833 2.0355 2.2345 2.1891 2.2676 2.9673 2.9942 2.4758 2.0904 2.0797 2.4471 3.1635 3.3353 2.8126 2.5854 3.2744 5.6392 1.5116 1.5260 1.5878 2.6090 3.3579 3.5834 3.1216 2.1323 1.7220 2.0364 2.4284 2.0774 2.1969 1.8226 2.2350 2.2058 3.2093 1.4227 1.3998 1.4333 3.4498 2.1756 2.7735 2.7889 2.8576 1.4743 1.5040 1.5525 1.6877 1.6278 1.6301 1.7169 1.6007 1.6660 1.0336 1.0353 1.0710 1.8806 2.1758 2.0588 1.7385 1.7495 2.1155 2.2812 1.2931 1.3078 1.3308 1.2719 1.2573 1.2732 1.2950 1.2782 1.3152 1.5959 1.5510 1.6578 1.4773 1.5265 1.4462 1.3241 1.3518 1.3665 1.4328 1.4509 1.4122 1.4474 1.4347 1.4499 1.4531 1.4322 1.4063 1.4472 1.4334 1.3249 1.0901 1.3900 1.0853 1.0903 1.0868 1.0881 1.0875 1.1309 1.1074 1.0975 1.0846 1.0835 1.0802 1.0923 1.0949 1.1174 9.8415 1.0785 1.0779 1.0622 1.0640 1.0647 1.0619 1.0606 1.0644 1.0681 1.0637 1.0644 1.0628 1.0625 1.0643 1.0658 1.0638 1.0632 1.0806 1.0963 1.0970 1.0965 1.0981 1.0958 1.0988 1.1014 1.0965 1.1021 1.1018 1.0996 1.1015 1.1025 1.0981 1.1026 1.0763
irintensity: 0.2574 0.1876 0.2975 0.4057 0.0534 0.4988 0.5602 0.3396 0.4973 2.9596 0.5837 1.6465 5.1176 2.3236 0.2097 1.2030 4.9781 1.2208 7.4919 49.1185 35.9459 1.9646 4.3828 4.7479 10.3917 1.7997 3.2998 2.8531 1.5816 3.1839 1.6634 10.6686 1.0848 1.1402 3.9070 0.7591 6.3264 0.8208 2.3622 0.5264 5.6150 3.7991 0.7897 3.2422 1.2499 2.3249 16.1806 5.6285 7.3953 7.6976 1.7907 10.6722 5.0892 118.7923 13.6915 12.5458 6.9508 159.9519 3.0371 13.3195 20.8352 14.8470 0.4270 2.0818 0.6955 4.0081 6.1788 4.1099 0.0177 1.1957 1.0213 1.3335 2.2580 1.7475 12.1093 13.0434 1.2699 4.3922 5.6219 10.5610 95.2235 3.3580 2.8572 4.3579 3.9129 0.3960 5.4990 16.5265 3.1000 8.9181 29.7194 1.1880 3.8958 10.8200 6.3010 8.4643 0.3745 1.3720 0.1396 0.2019 0.5606 0.7080 1.9985 1.6267 0.6306 1.5174 2.8925 12.9312 10.0487 17.6627 14.9510 14.2243 193.4025 4.7780 3.5094 8.8128 1.0723 14.2072 28.3916 30.5354 7.2173 13.5682 14.0970 26.9178 3.2373 15.3852 4.3620 546.9854 31.5657 37.0528 47.7429 45.7495 20.2574 9.2756 42.3668 12.0859 7.4464 18.1907 127.3055 24.4016 49.9182 49.8953 99.6138 19.8894 33.4180 60.5568 87.1556 63.8905 63.7782 70.8696 58.8829 7.8104 13.4874 44.4002 59.3207 62.5136 26.2289 19.6426 146.2183 57.1594 86.2131 14.4181
temp: 298.150 k
press: 1.00000 atm
elementType: 8 7 7 6 6 6 6 6 6 6 6 6 6 6 6 6 6 6 6 6 6 6 1 1 1 1 1 1 1 1 1 1 1 1 1 1 1 1 1 1 1 1 1 1 1 1 1 1 1 1 1 1 1 1 1 1
symmnumber: 1
zpe: 1325011.8 jmol-1
zpe.correction: 0.504670 hartree
zpe.thermalcorrener: 0.526043 hartree
zpe.thermalcorrenthalpy: 0.526987 hartree
zpe.thermalcorrgfe: 0.453247 hartree
zpe.sumelectzpe: -927.384703 hartree
zpe.sumelectthermal: -927.363331 hartree
zpe.sumelectthermalent: -927.362386 hartree
zpe.sumelectthermalfe: -927.436127 hartree
dipole: -2.3349 2.2625 -0.3989
dipole: 3.2756
quadrupole: -132.2609 -133.1721 -136.6617
quadrupole: 2.0266 3.5861 -0.1996
quadrupole: 1.7707 0.8595 -2.6301 2.0266 3.5861 -0.1996
hfenergy: -927.8893733 hartree
pointgroup: C01 [X(C19H34N2O1)]
dipole: -1.0538127 0.7088059 -0.2188879 debye
polarizability: 237.4307443|-3.3624531|228.0487128|5.2999812|-5.3670687|187.6164035 unknown
InChI: InChI=1S/C19H34N2O/c1-4-10-16(11-5-1)20-19(21-17-12-6-2-7-13-17)22-18-14-8-3-9-15-18/h16-18,20H,1-15H2
charge 0 multiplicity 1
56 atoms
O  0.367199 1.261347 -0.963103
N  -1.333621 -0.394529 -0.801506
N  0.830711 -0.883906 0.000174
C  -1.855885 -1.747672 -0.490803
C  -3.129611 -2.011315 -1.330351
C  -2.157312 -1.902914 1.024351
C  -0.579713 2.407985 -0.751911
C  2.214578 -0.475168 0.334152
C  -4.336534 -1.149601 -0.879121
C  -3.354644 -1.035635 1.47451
C  -4.618156 -1.335418 0.631678
C  0.078386 3.608882 -1.453138
C  -0.817404 2.658948 0.752998
C  2.663596 -1.231779 1.611059
C  3.177386 -0.803861 -0.844618
C  1.355876 4.085561 -0.722132
C  0.457363 3.1547 1.476027
C  2.77438 -2.755275 1.368063
C  3.298077 -2.325877 -1.091606
C  1.066297 4.388731 0.767778
C  3.734876 -3.06854 0.194823
C  -0.007429 -0.054049 -0.54168
H  -1.067912 -2.478881 -0.761695
H  -2.913863 -1.853964 -2.406672
H  -3.393563 -3.080684 -1.213076
H  -1.243512 -1.654451 1.593131
H  -2.381385 -2.972353 1.218877
H  -1.545091 2.176057 -1.249663
H  2.270849 0.620512 0.517736
H  -5.229904 -1.420126 -1.474606
H  -4.13932 -0.07563 -1.080073
H  -3.561686 -1.205611 2.548863
H  -3.088891 0.035552 1.363802
H  -5.456847 -0.684482 0.946863
H  -4.93817 -2.382762 0.813842
H  -0.663596 4.433472 -1.479024
H  0.305772 3.334861 -2.499951
H  -1.203725 1.73517 1.224495
H  -1.615916 3.42501 0.84147
H  1.948512 -1.024511 2.430445
H  3.651141 -0.832453 1.924358
H  2.825414 -0.284228 -1.756011
H  4.177969 -0.391451 -0.595669
H  2.125015 3.292901 -0.793073
H  1.761471 4.982937 -1.227531
H  0.217609 3.391805 2.530361
H  1.205338 2.338386 1.490676
H  1.76632 -3.143799 1.125886
H  3.115364 -3.264042 2.291277
H  4.017741 -2.519392 -1.911559
H  2.313245 -2.713758 -1.417569
H  0.357867 5.241075 0.839581
H  1.995723 4.700775 1.281787
H  4.764512 -2.753341 0.468737
H  3.772125 -4.160674 0.011859
H  -1.82552 0.148164 -1.511823
