program: Gaussian 09
title: 000239309
version: EM64L-G09RevD.01
frameworkgroup: C1[X(C12H14Cl2N2)]
method: RPBEPBE
basis: SDD
operation: Freq
keyword: #p
keyword: freq=noraman
keyword: PBEPBE/SDD
title: #p freq=noraman PBEPBE/SDD
converged: YES YES NO NO
title: Mulliken charges:
elementType: Cl Cl N N C C C C C C C C C C C C H H H H H H H H H H H H H H
charge: -0.036544 -0.022318 -0.135943 -0.101118 0.077932 0.369084 0.285128 -0.633849 -0.633950 -0.793112 -0.341864 -0.404853 -0.041389 -0.180777 -0.152141 -0.671853 0.224944 0.259482 0.231064 0.263878 0.222842 0.251668 0.215995 0.269678 0.224417 0.283109 0.259211 0.254267 0.229557 0.227454
chargesum: 0.00000
title: Mulliken charges with hydrogens summed into heavy atoms:
elementType: Cl Cl N N C C C C C C C C C C C C
charge: -0.036544 -0.022318 -0.135943 -0.101118 0.077932 0.369084 0.285128 0.081641 0.104438 -0.083022 -0.058755 -0.145643 -0.041389 0.073490 -0.152141 -0.214841
polarizability: 2.76158112e+02 5.36427298e+00 1.50950215e+02 -3.11274857e+00 6.42225219e+00 1.10119076e+02
1716.lowfreq: -6.7553 -0.0016 -0.0015 -0.0011 4.5754 6.4916 34.4790 41.6217 46.3369
frequency: 34.4416 41.5933 46.3267 73.8398 104.1658 125.2188 144.0504 156.5258 178.3414 198.2036 202.5839 220.0256 227.1872 267.1192 283.0546 306.2390 337.6718 349.1184 394.6507 407.0714 418.5782 443.0647 450.0703 511.0139 550.1218 573.3893 629.6078 650.0243 658.2240 691.3618 726.2603 759.6853 816.5260 865.0973 871.5148 905.1790 946.9909 960.2118 967.0996 991.3974 1005.2567 1051.7192 1054.6054 1095.9805 1102.5325 1113.9838 1129.4969 1135.6200 1195.4967 1232.6764 1251.8404 1298.8584 1328.2596 1368.2914 1387.3997 1394.8241 1421.9545 1430.6378 1445.8374 1447.5287 1451.7475 1464.4081 1467.4688 1475.3021 1480.4522 1499.8464 1538.8728 1588.2819 1595.5101 1650.3372 2952.1197 2960.2997 2980.0581 3020.8523 3036.2872 3064.3685 3099.2207 3100.8964 3111.7067 3129.2113 3154.9511 3157.7050 3175.4377 3202.8970
redmass: 4.8774 4.2177 5.0428 3.7542 3.2742 4.2900 1.1247 1.7135 12.7033 5.6729 3.0607 1.2093 2.2791 4.6720 2.5688 4.4793 4.1499 2.8058 6.2093 3.3401 4.2608 3.2633 5.4147 3.7801 3.2866 4.9328 3.6740 3.6018 3.0220 3.3082 6.1681 1.9995 1.3954 1.5357 5.7949 3.0893 1.3352 1.3492 1.8822 4.8631 1.4321 1.5112 1.4221 1.3084 1.8544 2.2167 1.3406 1.3741 3.5870 2.7236 1.7245 3.5628 4.3398 2.8138 1.3038 4.9690 1.2365 1.1320 1.4217 1.2103 1.5957 1.0508 1.0500 1.0694 1.0518 1.1779 7.7158 7.0741 8.0233 4.9094 1.0386 1.0390 1.0378 1.1007 1.0982 1.0945 1.0648 1.0979 1.0976 1.0951 1.0881 1.0919 1.0973 1.1144
irintensity: 0.8385 1.3156 0.3020 1.2347 1.3818 0.8980 0.6547 2.8655 0.5048 0.7712 1.1733 0.8175 2.9083 10.4194 0.3076 0.6684 2.3522 4.5225 6.3001 5.9565 5.2257 5.7942 30.7628 0.5468 7.5122 5.2248 17.0149 17.4844 1.1450 4.8599 29.2209 2.7602 35.3355 23.4660 34.0065 5.3761 0.0443 48.0982 49.6535 24.7598 28.0721 8.7946 9.7263 20.1270 66.6886 77.1534 1.8971 4.9880 38.1956 7.9848 1.4036 4.1486 4.6642 54.7571 17.4209 0.8874 15.9481 7.9690 49.5210 5.8496 118.6387 7.2487 27.8463 22.9197 7.3450 61.2409 31.5329 359.9231 333.6451 8.4021 62.1283 68.5161 20.6548 44.5849 24.6056 16.4969 15.4914 17.3629 11.6629 9.7954 2.7327 2.3416 4.4718 17.5544
temp: 298.150 k
press: 1.00000 atm
elementType: 17 17 7 7 6 6 6 6 6 6 6 6 6 6 6 6 1 1 1 1 1 1 1 1 1 1 1 1 1 1
symmnumber: 1
zpe: 608503.8 jmol-1
zpe.correction: 0.231767 hartree
zpe.thermalcorrener: 0.249003 hartree
zpe.thermalcorrenthalpy: 0.249947 hartree
zpe.thermalcorrgfe: 0.185780 hartree
zpe.sumelectzpe: -1494.072516 hartree
zpe.sumelectthermal: -1494.055280 hartree
zpe.sumelectthermalent: -1494.054336 hartree
zpe.sumelectthermalfe: -1494.118503 hartree
dipole: 5.0986 1.4159 -1.5490
dipole: 5.5136
quadrupole: -109.7840 -105.1661 -106.5107
quadrupole: 8.8263 1.9453 -0.7310
quadrupole: -2.6304 1.9875 0.6429 8.8263 1.9453 -0.7310
hfenergy: -1494.3042832 hartree
pointgroup: C01 [X(C12H14Cl2N2)]
dipole: 1.8204431 0.8884529 -0.7760062 debye
polarizability: 263.9340779|18.6763507|137.1931797|-39.3824317|16.262247|136.1001455 unknown
InChI: InChI=1S/C12H14Cl2N2/c1-8(2)12(16(3)4)15-9-5-6-10(13)11(14)7-9/h5-7H,1H2,2-4H3
charge 0 multiplicity 1
30 atoms
Cl -2.626509 1.132878 3.032872
Cl -4.924498 -0.355671 1.187572
N  1.759029 1.566093 -0.359658
N  0.931137 -0.720606 -0.353211
C  1.908606 0.169741 -0.326244
C  3.308855 -0.394547 -0.388184
C  -0.419332 -0.533822 -0.020378
C  2.701846 2.502185 0.283846
C  0.541269 2.201511 -0.891317
C  3.533255 -1.694406 0.354804
C  -0.824908 0.176457 1.152134
C  -1.423183 -1.193978 -0.788513
C  -2.180993 0.223499 1.520647
C  -2.778259 -1.122501 -0.418186
C  -3.167838 -0.412436 0.739193
C  4.272679 0.204344 -1.141611
H  3.12099 3.22046 -0.447847
H  3.532738 1.954263 0.749275
H  2.174397 3.081103 1.069346
H  0.031835 1.520991 -1.590388
H  0.833474 3.116837 -1.43986
H  -0.180315 2.483936 -0.098509
H  4.546986 -2.091429 0.178123
H  2.7830 -2.437143 0.031925
H  3.391116 -1.558662 1.444233
H  -0.076964 0.661195 1.786808
H  -1.11803 -1.764687 -1.670181
H  -3.543804 -1.624059 -1.017802
H  5.275346 -0.228951 -1.228062
H  4.076178 1.118705 -1.712127
