program: Gaussian 09
title: 000239308
version: EM64L-G09RevD.01
frameworkgroup: C1[X(C13H18Cl2N2)]
method: RPBEPBE
basis: SDD
operation: Freq
keyword: #p
keyword: freq=noraman
keyword: PBEPBE/SDD
title: #p freq=noraman PBEPBE/SDD
converged: YES YES NO NO
title: Mulliken charges:
elementType: Cl Cl N N C C C C C C C C C C C C C H H H H H H H H H H H H H H H H H H
charge: -0.040793 -0.026975 -0.118380 -0.101223 -0.153014 -0.371277 0.171609 -0.717643 -0.706431 -0.662893 -0.649412 0.292196 -0.356454 -0.416703 -0.034832 -0.179366 -0.155502 0.212078 0.235837 0.191418 0.204145 0.220058 0.244466 0.217227 0.197773 0.232497 0.236884 0.252096 0.239767 0.228871 0.255197 0.268923 0.281676 0.255683 0.252498
chargesum: 0.00000
title: Mulliken charges with hydrogens summed into heavy atoms:
elementType: Cl Cl N N C C C C C C C C C C C C C
charge: -0.040793 -0.026975 -0.118380 -0.101223 0.059064 0.055978 0.171609 -0.048974 -0.058934 0.065855 0.103579 0.292196 -0.074778 -0.161020 -0.034832 0.073132 -0.155502
polarizability: 2.65029652e+02 -8.00487769e+00 1.73018832e+02 -1.45561870e-01 -4.06099438e+00 1.21209480e+02
1716.lowfreq: -8.1163 -2.4904 0.0010 0.0020 0.0024 5.2799 25.9602 39.8240 44.8116
frequency: 25.9574 39.7946 44.7551 56.6165 86.7402 105.5261 120.5688 136.4342 166.8824 178.3528 184.8604 190.9243 197.8298 221.8434 229.1201 239.1215 256.2342 277.4242 314.6627 325.5382 382.5114 399.8527 413.3085 422.3456 441.7335 456.4851 492.7535 547.9814 572.8939 633.7294 654.6450 688.0730 695.6598 726.4655 796.6992 812.8938 838.4360 858.6914 867.9338 942.2249 944.0777 968.5599 989.8010 1008.7591 1030.5458 1054.1230 1091.0134 1096.0576 1099.8188 1111.5300 1113.2630 1126.5879 1128.6161 1179.0379 1206.1348 1239.3822 1259.4991 1280.0125 1286.5844 1325.0697 1328.0827 1335.5449 1378.1879 1384.9069 1390.8132 1396.5534 1433.6441 1446.4881 1454.5896 1456.6973 1467.7710 1471.3722 1475.4270 1479.3292 1484.7110 1485.1048 1487.6973 1492.5969 1536.1660 1591.8063 1624.5367 2958.5802 2969.4157 2973.0181 2975.5090 2986.8100 3005.4315 3044.3243 3050.5912 3050.8666 3067.0540 3073.1292 3079.1144 3087.3539 3108.5725 3113.7914 3152.9201 3155.4412 3173.6644
redmass: 4.5633 5.6061 4.6111 3.5548 2.9069 2.5924 4.1037 1.8081 1.8933 2.8723 3.5686 1.3080 3.3748 1.0319 3.1666 1.9176 2.2076 4.4418 2.9093 6.1045 6.2652 2.4685 4.2311 4.8929 3.3699 3.8868 3.3066 3.6959 5.3802 5.5665 6.3258 3.2315 6.2840 3.3614 1.3905 1.4002 2.1169 1.6020 3.8269 2.2260 1.4037 1.3419 4.8747 1.5747 2.7816 1.4591 1.6343 1.4848 1.9570 1.9087 2.1113 1.4853 1.3461 2.2983 3.2732 1.5863 1.3471 2.5580 1.2851 4.1161 1.6869 1.4228 1.6382 1.2368 1.4663 4.8655 1.1315 1.7766 1.1321 1.4552 1.0467 1.0487 1.0468 1.0577 1.0530 1.0696 1.0752 1.1377 7.7744 7.2232 8.3593 1.0413 1.0384 1.0362 1.0356 1.0637 1.0828 1.0961 1.0985 1.0970 1.0990 1.0985 1.1009 1.1002 1.0981 1.0973 1.0880 1.0919 1.0973
irintensity: 0.2116 0.8408 0.0790 2.3756 0.3551 0.4340 0.5635 0.3257 0.3632 0.5694 0.3234 0.3710 1.3386 0.2378 2.7254 0.7328 3.1361 3.7842 0.8139 4.4009 1.4001 3.9256 3.8703 4.7755 7.0800 18.6423 4.3254 22.3407 7.1918 22.3539 8.4953 3.2488 5.2508 28.9087 11.1409 33.6497 2.0539 22.3631 35.2388 35.6293 5.2087 6.2207 23.3657 22.0757 5.6501 13.1636 9.4491 1.7472 1.3673 62.6302 52.9917 10.8080 5.2058 24.8193 36.2227 3.0583 9.6281 3.9249 0.4557 4.1725 16.3029 4.2607 11.3428 7.6445 45.8152 2.9183 5.1144 67.4568 27.8541 88.4704 22.8869 16.1268 12.6104 4.6238 8.9511 10.4379 25.5946 38.8919 36.1399 124.3234 712.1943 76.0088 51.1296 45.8346 21.9834 48.8908 30.2444 39.8923 14.4208 2.7872 37.1925 41.8086 55.4167 55.3868 13.7055 15.2319 3.2378 2.9139 5.5048
temp: 298.150 k
press: 1.00000 atm
elementType: 17 17 7 7 6 6 6 6 6 6 6 6 6 6 6 6 6 1 1 1 1 1 1 1 1 1 1 1 1 1 1 1 1 1 1
symmnumber: 1
zpe: 742944.3 jmol-1
zpe.correction: 0.282973 hartree
zpe.thermalcorrener: 0.302225 hartree
zpe.thermalcorrenthalpy: 0.303169 hartree
zpe.thermalcorrgfe: 0.234250 hartree
zpe.sumelectzpe: -1534.491088 hartree
zpe.sumelectthermal: -1534.471836 hartree
zpe.sumelectthermalent: -1534.470892 hartree
zpe.sumelectthermalfe: -1534.539811 hartree
dipole: -5.8041 1.7148 2.1685
dipole: 6.4289
quadrupole: -122.0754 -110.0855 -114.9241
quadrupole: -9.3613 -0.1025 1.4141
quadrupole: -6.3804 5.6095 0.7709 -9.3613 -0.1025 1.4141
hfenergy: -1534.7740605 hartree
pointgroup: C01 [X(C13H18Cl2N2)]
dipole: 2.2336043 0.2172665 -1.1667326 debye
polarizability: 264.6118145|0.6156553|169.5645849|-12.3178993|-12.4091604|125.0815643 unknown
InChI: InChI=1S/C13H18Cl2N2/c1-5-9(2)13(17(3)4)16-10-6-7-11(14)12(15)8-10/h6-9H,5H2,1-4H3
charge 0 multiplicity 1
35 atoms
Cl -3.510617 2.420093 0.287499
Cl -5.234092 -0.395238 0.423483
N  1.581952 0.824754 -1.462751
N  0.832059 -0.52484 0.401501
C  3.14287 0.23774 0.421991
C  3.560722 -1.15222 0.974805
C  1.750291 0.175293 -0.235609
C  3.128347 1.29829 1.556005
C  3.757632 -2.216914 -0.124107
C  2.548359 1.803666 -2.000367
C  0.467882 0.497952 -2.373195
C  -0.563036 -0.460719 0.308311
C  -1.271766 0.781762 0.279304
C  -1.326417 -1.66406 0.393154
C  -2.676853 0.801613 0.319991
C  -2.732156 -1.628886 0.418122
C  -3.41978 -0.395304 0.380117
H  3.894313 0.52638 -0.337424
H  2.782933 -1.487377 1.684001
H  4.503433 -1.021418 1.543463
H  2.868641 2.307794 1.184304
H  4.11923 1.358784 2.042113
H  2.381294 1.01627 2.319136
H  4.075443 -3.181288 0.312524
H  4.529931 -1.90739 -0.854654
H  2.813735 -2.391954 -0.671615
H  3.270683 1.337169 -2.700811
H  3.105912 2.302635 -1.194111
H  1.99362 2.585424 -2.550656
H  0.840288 0.519495 -3.413784
H  -0.377864 1.207292 -2.283294
H  0.086023 -0.512614 -2.162256
H  -0.72047 1.726521 0.251799
H  -0.794834 -2.618471 0.448098
H  -3.308506 -2.557236 0.475818
