program: Gaussian 09
title: 000239307
version: EM64L-G09RevD.01
frameworkgroup: C1[X(C12H16Cl2N2)]
method: RPBEPBE
basis: SDD
operation: Freq
keyword: #p
keyword: freq=noraman
keyword: PBEPBE/SDD
title: #p freq=noraman PBEPBE/SDD
converged: YES YES NO NO
title: Mulliken charges:
elementType: Cl Cl N N C C C C C C C C C C C C H H H H H H H H H H H H H H H H
charge: -0.040819 -0.026958 -0.121653 -0.098747 -0.181460 0.191671 -0.691266 -0.697861 -0.648454 -0.662234 0.287440 -0.353692 -0.414248 -0.034699 -0.179078 -0.155198 0.220817 0.220980 0.203918 0.244058 0.203309 0.214311 0.249383 0.270143 0.253755 0.228811 0.236249 0.240327 0.251063 0.281397 0.256193 0.252542
chargesum: 0.00000
title: Mulliken charges with hydrogens summed into heavy atoms:
elementType: Cl Cl N N C C C C C C C C C C C C
charge: -0.040819 -0.026958 -0.121653 -0.098747 0.039357 0.191671 -0.022310 -0.030859 0.104255 0.065405 0.287440 -0.072295 -0.158055 -0.034699 0.073464 -0.155198
polarizability: 2.53319759e+02 4.98423697e+00 1.59519493e+02 6.79397741e-01 -7.74025655e+00 1.12738491e+02
1716.lowfreq: -7.3488 -4.2155 -0.0026 -0.0022 -0.0014 4.1489 29.5449 42.9657 47.5032
frequency: 29.5211 42.9358 47.4910 63.4214 98.4315 122.7723 140.8737 172.3910 186.5869 191.0127 200.3913 205.7116 207.1901 235.6421 250.8326 269.8743 302.5365 323.1336 332.2076 389.1045 409.4163 420.5658 442.0511 450.9035 498.6517 551.8005 572.7252 633.7120 655.8034 688.6533 696.7056 733.8886 813.0027 858.1771 863.2015 872.5919 927.0660 943.9453 957.4995 964.4770 990.1297 1054.5775 1085.0259 1094.5727 1105.4847 1112.8467 1119.7166 1128.6472 1129.2524 1183.9191 1208.1473 1240.2488 1278.1025 1302.4901 1323.3384 1325.9778 1372.9481 1377.8984 1393.7165 1396.7222 1434.0113 1447.6303 1454.5104 1456.8788 1468.4806 1469.4924 1475.9466 1481.5858 1488.6213 1490.9544 1494.8523 1536.7398 1591.9267 1628.0294 2957.2525 2968.2178 2974.6098 2985.8462 3014.7056 3042.8330 3048.1118 3065.9775 3078.6642 3087.6256 3107.7112 3110.4520 3114.5987 3153.0306 3154.8698 3173.7633
redmass: 4.5828 5.6635 3.8785 3.3715 2.9907 4.1780 1.5838 3.4773 2.7394 2.9461 1.5239 1.9224 1.7216 1.1105 3.1814 2.9577 4.1821 3.5925 3.7091 7.4299 2.8456 4.6265 3.3682 4.0772 3.2506 3.9616 5.3910 5.5569 6.5614 3.2132 7.1960 4.3813 1.3973 1.7734 3.8635 2.6195 1.1772 1.3328 2.6044 1.4516 4.9193 1.4444 1.6435 1.2967 2.0546 2.2248 1.8009 1.4074 1.5317 2.1071 3.1831 1.5664 3.2394 1.4118 1.6363 4.0039 1.2119 1.8590 1.3901 4.6607 1.1326 1.8123 1.2524 1.2145 1.0495 1.0498 1.0506 1.0578 1.0913 1.0646 1.1286 7.7720 7.2210 8.4235 1.0418 1.0384 1.0355 1.0362 1.0831 1.0961 1.0984 1.0991 1.0999 1.1004 1.0994 1.0978 1.0972 1.0880 1.0919 1.0973
irintensity: 0.3188 0.9828 0.4670 1.2578 0.8123 0.6730 0.4095 0.6517 0.2138 0.4497 0.3128 3.0285 0.6137 0.9875 4.5992 2.1852 0.9900 0.1541 7.6122 4.9394 5.8472 4.4452 6.6862 15.7019 4.0372 19.7089 7.4895 24.5116 10.7494 4.2633 3.4859 21.4531 35.1552 24.0531 29.5733 3.5655 5.0043 0.0593 47.6852 0.2336 23.0852 15.1616 24.5315 3.1990 40.8314 70.0728 16.9880 14.2803 12.2463 16.4582 44.6154 2.1893 3.5994 1.1719 13.9174 6.1696 16.9924 12.5338 48.7561 3.4018 5.8356 55.2217 61.8405 59.1319 10.1444 20.5557 9.0926 6.7878 25.6314 10.8809 40.0507 35.7640 118.2376 726.3437 81.2032 54.6817 30.1968 39.3624 31.9582 42.5476 13.1851 35.4730 45.3524 29.4363 30.2551 15.3210 14.2807 2.8860 2.9381 5.4544
temp: 298.150 k
press: 1.00000 atm
elementType: 17 17 7 7 6 6 6 6 6 6 6 6 6 6 6 6 1 1 1 1 1 1 1 1 1 1 1 1 1 1 1 1
symmnumber: 1
zpe: 669601.3 jmol-1
zpe.correction: 0.255038 hartree
zpe.thermalcorrener: 0.272910 hartree
zpe.thermalcorrenthalpy: 0.273854 hartree
zpe.thermalcorrgfe: 0.208257 hartree
zpe.sumelectzpe: -1495.267743 hartree
zpe.sumelectthermal: -1495.249871 hartree
zpe.sumelectthermalent: -1495.248927 hartree
zpe.sumelectthermalfe: -1495.314524 hartree
dipole: 5.8930 1.5800 2.1941
dipole: 6.4837
quadrupole: -110.8697 -105.7200 -108.0500
quadrupole: 9.8730 0.0597 0.7783
quadrupole: -2.6565 2.4933 0.1632 9.8730 0.0597 0.7783
hfenergy: -1495.5227807 hartree
pointgroup: C01 [X(C12H16Cl2N2)]
dipole: 2.2072352 0.6707154 -1.0886938 debye
polarizability: 250.0683532|18.2067053|142.7155305|-11.5472941|22.7157052|132.7938586 unknown
InChI: InChI=1S/C12H16Cl2N2/c1-8(2)12(16(3)4)15-9-5-6-10(13)11(14)7-9/h5-8H,1-4H3
charge 0 multiplicity 1
32 atoms
Cl -2.799721 -2.802973 -0.82729
Cl -4.986336 -0.630647 0.363372
N  1.872395 0.224013 -1.548689
N  0.959675 0.538142 0.672051
C  3.369376 0.255436 0.471828
C  1.964267 0.334493 -0.15657
C  3.597177 -1.163138 1.062194
C  3.538227 1.334252 1.568718
C  0.691615 0.7011 -2.293549
C  2.976407 -0.269464 -2.395902
C  -0.40524 0.278551 0.498186
C  -0.884909 -0.945055 -0.066778
C  -1.36481 1.190848 1.031638
C  -2.262892 -1.221685 -0.101347
C  -2.741223 0.907276 0.975626
C  -3.202225 -0.301199 0.407075
H  4.12866 0.447701 -0.30871
H  4.598009 -1.231766 1.526029
H  3.521317 -1.956166 0.29401
H  2.837825 -1.367704 1.837682
H  4.543244 1.255842 2.023386
H  3.421263 2.351016 1.152543
H  2.772951 1.199702 2.350252
H  0.136147 1.439671 -1.695987
H  -0.005346 -0.1185 -2.557099
H  1.031252 1.190192 -3.225235
H  3.591467 0.556826 -2.807422
H  2.548051 -0.832317 -3.245389
H  3.630398 -0.959146 -1.842335
H  -0.176944 -1.684731 -0.452689
H  -1.007344 2.115276 1.494346
H  -3.469831 1.616653 1.379655
