program: Gaussian 09
title: 000239305
version: EM64L-G09RevD.01
frameworkgroup: C1[X(C11H11Cl2NO)]
method: RPBEPBE
basis: SDD
operation: Freq
keyword: #p
keyword: freq=noraman
keyword: PBEPBE/SDD
title: #p freq=noraman PBEPBE/SDD
converged: YES YES NO NO
title: Mulliken charges:
elementType: Cl Cl O N C C C C C C C C C C C H H H H H H H H H H H
charge: -0.017715 -0.010435 -0.258605 -0.470384 0.539732 0.209607 0.141623 -0.458377 -0.352765 -0.025892 -0.180589 -0.798554 -0.254413 -0.122496 -0.731433 0.317998 0.252278 0.318636 0.275954 0.218103 0.233379 0.258035 0.216046 0.230697 0.231851 0.237718
chargesum: 0.00000
title: Mulliken charges with hydrogens summed into heavy atoms:
elementType: Cl Cl O N C C C C C C C C C C C
charge: -0.017715 -0.010435 -0.258605 -0.152386 0.539732 0.209607 0.141623 -0.206099 -0.034128 -0.025892 0.077445 -0.071118 -0.038367 -0.122496 -0.031166
polarizability: 2.49440035e+02 4.09628747e+00 1.58341983e+02 2.43188255e-01 -1.96788686e+00 7.41450958e+01
1716.lowfreq: -4.4977 -2.5310 -0.0017 -0.0015 0.0006 4.4278 31.3060 41.0717 75.1183
frequency: 31.2640 41.0651 75.1126 81.7713 98.4735 104.3164 116.6883 167.4867 179.3113 180.9983 230.0360 237.6993 292.9021 323.9864 345.9172 367.0965 396.6635 433.2202 441.0607 467.2352 513.4844 576.8295 617.8450 653.3498 654.9841 690.5347 697.4251 709.5914 835.9566 843.5890 849.9978 861.3653 879.7449 952.7469 979.5382 995.7118 1012.4134 1038.9997 1048.8792 1094.9623 1121.3060 1131.1700 1144.5947 1237.1019 1247.6137 1281.6366 1344.2605 1356.8561 1390.4345 1395.2392 1399.9351 1455.0425 1462.6738 1465.9317 1469.1140 1480.6771 1491.0888 1573.6757 1595.3500 1603.3451 1663.0266 2972.5799 2984.2391 3040.8310 3067.4738 3072.3475 3106.6778 3114.7493 3144.6087 3165.5418 3201.7764 3530.2003
redmass: 5.3109 4.5217 3.7853 3.2814 1.1859 1.1534 5.1977 5.8165 10.6930 5.6382 6.7782 5.1873 4.7827 3.2981 4.4576 7.0373 3.9415 6.0806 3.2215 6.3038 4.5166 4.2104 3.6564 1.2679 6.2943 3.1000 4.6823 4.2792 1.3284 2.4160 4.2071 1.6479 1.9515 2.0404 1.3112 5.2110 1.7356 1.4867 1.5352 2.5176 2.3287 2.5851 1.3579 1.4889 2.6865 2.0455 3.1534 1.5238 2.7161 1.8215 1.2171 1.0650 1.0517 2.8392 1.0526 1.0866 2.3427 7.9661 4.0157 6.9922 6.1153 1.0390 1.0406 1.0963 1.0929 1.0886 1.0977 1.0977 1.0922 1.0912 1.0953 1.0761
irintensity: 1.2975 0.0811 2.9476 2.5916 0.8764 2.8291 0.4192 2.1091 0.2806 1.4805 0.2089 1.1815 5.7326 3.1063 8.1309 0.1356 5.2475 10.5570 7.5124 15.3930 7.1704 17.9230 8.8696 34.8104 16.4797 11.3911 9.1058 28.1339 16.2493 3.6325 16.2306 68.9324 20.3911 8.3561 3.6873 27.4543 26.5727 1.0413 1.9625 52.1386 81.4038 37.7451 8.5410 9.8052 43.4467 17.2832 182.7304 16.7957 27.3593 5.4685 25.7434 16.6039 31.4206 156.3711 22.0321 30.7047 399.5059 147.0901 68.3616 56.4529 35.7524 25.8942 22.5754 17.8807 14.5036 13.9990 19.9640 32.8366 4.0810 1.4935 10.6801 11.5577
temp: 298.150 k
press: 1.00000 atm
elementType: 17 17 8 7 6 6 6 6 6 6 6 6 6 6 6 1 1 1 1 1 1 1 1 1 1 1
symmnumber: 1
zpe: 507404.2 jmol-1
zpe.correction: 0.193260 hartree
zpe.thermalcorrener: 0.208901 hartree
zpe.thermalcorrenthalpy: 0.209845 hartree
zpe.thermalcorrgfe: 0.148480 hartree
zpe.sumelectzpe: -1474.772672 hartree
zpe.sumelectthermal: -1474.757031 hartree
zpe.sumelectthermalent: -1474.756087 hartree
zpe.sumelectthermalfe: -1474.817452 hartree
dipole: 4.3913 2.8216 0.2130
dipole: 5.2240
quadrupole: -98.9731 -100.8336 -103.9917
quadrupole: 13.1187 1.1904 -0.5460
quadrupole: 2.2930 0.4326 -2.7256 13.1187 1.1904 -0.5460
hfenergy: -1474.9659317 hartree
pointgroup: C01 [X(C11H11Cl2N1O1)]
dipole: 1.7800058 -1.0097694 0.1901049 debye
dipolederiv: -0.3088298 -0.2515942 0.0965369 -0.3583792 -0.4707617 0.1528435 0.1303909 0.1475346 -0.0928476 -0.8536209 0.1236183 0.0623983 0.1510378 -0.0839143 -0.0038991 0.063231 -0.0014488 -0.0371978 -0.7483502 0.1603775 -0.0607732 -0.4493518 -0.8662402 0.2420183 0.1221536 0.197307 -0.4453475 -2.0359733 -0.2013684 0.1829233 -0.444078 -0.358578 0.080654 0.2982737 0.0582927 -0.3510951 1.4230558 -0.0285984 -0.1310189 -0.2895481 0.0762146 0.0386414 -0.0555104 0.0062524 0.1308486 -0.300007 0.2444448 -0.2638318 0.2689468 -0.1385429 -0.0798973 -0.3506375 -0.024014 0.0880827 1.903467 -0.1037307 0.0746877 0.9233949 1.0556108 -0.3617504 -0.2621701 -0.3062374 0.3279273 -0.4166512 -0.0735904 0.0452424 -0.2102525 -0.1599729 0.0252597 0.0929864 0.0072463 -0.1762553 -0.3198091 -0.0199398 0.0133092 0.1770738 -0.0686044 -0.0432415 -0.0344819 -0.0291124 -0.1567706 0.3066794 0.4281355 -0.1545729 0.5442123 0.7332186 -0.2577025 -0.1918665 -0.2571938 0.0694919 -0.0824164 0.0980521 -0.0228505 -0.0532176 0.072132 -0.0361635 0.0154862 -0.0535585 -0.0638459 -0.0662699 -0.026461 0.0890055 0.066012 -0.0572644 0.0958421 0.063445 0.1043558 -0.055762 0.1756783 -0.2205924 0.085879 -0.3355269 -0.0352397 -0.1402654 0.112144 -0.1564359 -0.0167961 0.972544 -0.3434351 -0.0385996 -0.2808515 -0.1557503 0.0493513 -0.0575981 0.0638532 -0.0915728 -0.13948 0.1032726 -0.0438442 0.2101913 -0.0287682 0.0766013 -0.1331032 0.1019025 -0.0017785 0.2140559 0.0149684 0.012175 0.0231701 0.1025557 0.0509949 0.0305334 0.0592857 0.2537231 0.0335501 0.0781036 -0.0033477 0.0763932 0.0056105 0.0342119 -0.0025423 0.0375477 0.161328 0.1811037 -0.0470658 0.0191728 -0.0127846 0.0944444 0.0222366 -0.0021566 0.0350292 0.1728358 0.1881238 0.0438307 0.0050555 -0.0041761 -0.0396691 0.0345048 -0.0111705 0.0058606 0.1121277 -0.166882 0.0055953 -0.0152827 0.0642022 0.1075747 0.0147967 -0.0649254 0.0046479 0.0709108 0.0924437 -0.0524237 -0.0111034 -0.0227672 0.0651903 -0.0981921 0.016816 -0.057736 -0.1003485 0.0546474 0.0422263 0.0019237 0.0533649 -0.0030667 0.0366552 0.0002008 0.0383106 0.1479464 -0.0920907 -0.0002535 0.1059299 -0.0448604 0.1004589 0.0610338 0.1387865 0.0532514 0.0102988 0.0237011 -0.0108096 -0.0262253 0.0335903 -0.1395842 0.0285357 0.0256417 -0.0025474 0.1298436 -0.0375612 -0.002314 0.0758985 -0.0568488 0.0937133 0.0468428 0.1497572 0.0204237 -0.01031 -0.0011085 0.0395518 -0.0986876 -0.028947 0.0992332 -0.0699124 -0.0936835 -0.0528171 -0.075437 unknown
polarizability: 248.4841637|-4.3042724|143.6662747|-13.3313866|-31.5808291|89.7766748 unknown
InChI: InChI=1S/C11H11Cl2NO/c1-3-7(2)11(15)14-8-4-5-9(12)10(13)6-8/h3-6,14H,1-2H3
charge 0 multiplicity 1
26 atoms
Cl -3.798757 -2.309076 1.008846
Cl -5.136151 0.645303 0.393755
O  1.655282 1.785315 -0.882943
N  0.835937 -0.279935 -0.119337
C  -0.553679 -0.013803 -0.014439
C  3.262144 0.020263 -0.40419
C  1.866742 0.59738 -0.486918
C  -1.39366 -1.090637 0.378347
C  -1.128596 1.259324 -0.281062
C  -2.780388 -0.897434 0.502941
C  -2.520003 1.432603 -0.148492
C  4.223156 0.58842 -1.427799
C  3.590703 -0.863469 0.588712
C  -3.354014 0.364473 0.241803
C  4.936966 -1.499764 0.834224
H  1.122935 -1.24459 0.060811
H  -0.975274 -2.080669 0.590213
H  -0.486378 2.084102 -0.591893
H  4.026248 1.668322 -1.543646
H  5.277636 0.44442 -1.145514
H  4.064857 0.12677 -2.421767
H  -2.968271 2.409405 -0.352387
H  2.822352 -1.123716 1.33454
H  4.841787 -2.60246 0.875938
H  5.677054 -1.253136 0.056852
H  5.345868 -1.183109 1.813804
