program: Gaussian 09
title: 000239304
version: EM64L-G09RevD.01
frameworkgroup: C1[X(C17H34N2O2)]
method: RPBEPBE
basis: SDD
operation: Freq
keyword: #p
keyword: freq=noraman
keyword: PBEPBE/SDD
title: #p freq=noraman PBEPBE/SDD
converged: YES YES NO NO
title: Mulliken charges:
elementType: O O N N C C C C C C C C C C C C C C C C C H H H H H H H H H H H H H H H H H H H H H H H H H H H H H H H H H H
charge: -0.306284 -0.250724 -0.167368 -0.449449 -0.384848 -0.387069 -0.384800 -0.371864 -0.382025 -0.366420 -0.372824 -0.416725 -0.353344 -0.307377 -0.356675 -0.359252 -0.363495 -0.295289 -0.298126 0.283852 -0.696558 0.193914 0.193128 0.193884 0.194772 0.193371 0.193461 0.187804 0.194279 0.192125 0.191791 0.215882 0.187584 0.189474 0.189565 0.195266 0.217029 0.187535 0.187674 0.207190 0.227580 0.194809 0.194842 0.249786 0.215974 0.215500 0.272897 0.215706 0.191828 0.194258 0.217451 0.209544 0.215183 0.209686 0.255893
chargesum: 0.00000
title: Mulliken charges with hydrogens summed into heavy atoms:
elementType: O O N N C C C C C C C C C C C C C C C C C
charge: -0.306284 -0.250724 -0.167368 -0.193556 0.002194 0.001587 0.002031 0.010218 0.001892 0.037046 0.006215 -0.004430 0.021865 0.127393 0.032976 0.106508 0.124902 0.112244 0.113583 0.283852 -0.062145
polarizability: 2.54665990e+02 1.53721701e+00 2.03566555e+02 9.92363706e+00 5.99305609e+00 1.66319037e+02
1716.lowfreq: -4.4349 -1.9310 -0.0015 -0.0008 -0.0004 6.1156 10.4299 19.3588 25.6096
frequency: 9.4650 18.7623 25.5209 32.7157 35.2470 45.0723 61.4951 66.0857 72.3622 90.2461 93.9587 104.2949 113.1139 126.5989 133.9005 147.2146 155.0946 170.5293 193.3155 217.7177 231.4585 255.1357 263.2078 275.2454 305.4554 336.8732 372.3762 378.7325 388.5080 448.5969 461.6594 479.2672 494.3514 510.4972 554.7364 616.4892 631.1520 656.5831 719.3096 721.3021 725.2957 733.4900 748.5409 769.0288 790.6901 804.3309 835.2772 842.6543 874.1433 887.8204 894.4261 912.3536 927.9790 965.6318 985.2243 987.2082 989.6207 998.6949 1020.8227 1024.4716 1026.7586 1038.9457 1051.8964 1058.2866 1071.6219 1072.8632 1077.4328 1079.1357 1080.5183 1084.3861 1096.0496 1114.8966 1124.7372 1143.9601 1181.6352 1190.5761 1192.0190 1196.2135 1205.8281 1219.4438 1221.2353 1235.8068 1245.0564 1262.1647 1269.1901 1270.3244 1273.5298 1276.4590 1281.9613 1284.8683 1291.5423 1295.4692 1296.1425 1299.2373 1321.9131 1326.1235 1341.4798 1343.8010 1346.5209 1352.8247 1354.9204 1356.3653 1362.2728 1366.0846 1366.8528 1389.5534 1400.8242 1445.4483 1449.2779 1451.7287 1456.2127 1459.2236 1459.5376 1462.6477 1462.7350 1463.3771 1466.7818 1471.9395 1477.2083 1477.5889 1480.1947 1482.4925 1486.5387 1488.8186 1649.6007 2944.4076 2948.2772 2948.7343 2949.8145 2950.7871 2951.7922 2952.4118 2952.9296 2957.3277 2957.5058 2962.4041 2965.4668 2966.5372 2967.8838 2971.4297 2978.3403 2981.6408 2984.8911 2989.9714 2997.2959 3007.2988 3014.8398 3018.9209 3026.7442 3033.6058 3041.3392 3053.4049 3067.8248 3070.0760 3079.2557 3084.8290 3086.4058 3107.0871 3462.9409
redmass: 4.5757 3.7085 3.6452 1.6790 3.6795 3.5494 2.6697 2.0614 4.3640 2.8394 3.1136 3.0253 2.1813 3.4057 2.2758 2.1613 2.0157 3.4749 2.8374 2.1545 1.1173 3.0003 2.6392 3.4296 2.8116 5.0086 3.1107 3.6438 1.8646 2.8672 2.7988 3.2412 3.9889 3.0529 2.8488 2.2284 1.1387 9.0829 1.0585 1.0715 1.1700 1.3597 1.5570 1.4574 3.2023 1.4791 1.7020 1.6223 1.8101 1.9054 1.7030 1.9521 1.5925 1.7541 3.5109 1.8651 2.6641 2.3317 2.0947 1.2208 3.6175 2.5962 2.2806 3.0660 2.7335 2.4800 2.0240 2.0583 2.2006 2.3229 2.2167 2.0903 2.9282 1.7124 1.8318 2.2261 1.0887 1.2830 1.4985 1.3871 1.5054 1.3774 1.2943 1.2941 1.8934 1.2760 1.2398 1.0174 1.1599 1.0802 1.0908 1.1833 1.1597 1.1748 1.3588 1.2286 1.4065 1.2935 1.3494 1.6707 1.6187 1.6572 1.4609 1.6320 1.2696 1.2175 2.5114 1.0853 1.0806 1.1000 1.0776 1.0747 1.0725 1.0886 1.0709 1.0703 1.0808 1.0838 1.0651 1.0610 1.0852 1.0889 1.0936 1.0938 6.6265 1.0697 1.0586 1.0585 1.0591 1.0591 1.0666 1.0584 1.0594 1.0664 1.0603 1.0595 1.0665 1.0620 1.0589 1.0365 1.0634 1.0960 1.0967 1.0982 1.1004 1.1021 1.1033 1.1037 1.1023 1.1042 1.1045 1.1034 1.1006 1.0993 1.0966 1.0951 1.0965 1.0916 1.0773
irintensity: 0.1444 0.1705 0.0414 0.0149 0.1277 0.0654 0.2492 0.0559 1.4371 0.1647 0.4092 0.1657 0.5690 0.1201 0.1142 0.0832 0.0157 0.0819 1.4019 4.1578 0.0010 20.9464 0.3512 2.9142 2.4653 4.2553 0.4136 2.9011 0.3641 2.5376 1.1263 1.2277 2.6509 9.1165 23.4699 13.6772 89.8516 6.5542 17.8948 0.7516 11.5805 7.9412 15.7068 10.7937 17.4191 11.5413 0.7708 2.4479 0.8678 4.8346 0.1323 0.3729 2.0057 14.9096 1.5740 4.3096 54.9120 154.5124 11.4987 8.7950 10.7269 28.3780 72.4815 9.5026 83.1426 28.0090 37.0552 0.7804 4.8361 27.6710 16.6594 51.3715 4.9669 4.5814 0.6111 24.9600 5.0022 17.0602 12.6356 71.6516 146.2544 7.8530 0.4813 2.5190 93.2254 0.4882 32.5953 0.2040 1.4740 0.1337 0.2086 0.2230 0.0421 1.3246 0.0264 1.9558 7.4001 20.0941 21.0993 0.0781 0.0377 1.4608 7.3079 0.1770 0.1145 11.3652 71.2453 3.6847 5.7157 17.5178 3.7215 0.0264 0.1024 13.7132 3.1461 0.1393 0.3370 0.6198 5.9215 7.6315 6.6441 1.7968 4.8225 36.9699 399.6818 49.2651 0.6345 0.5936 0.7883 0.7929 26.5804 28.7114 3.9880 44.0205 3.3739 49.1331 111.6356 28.6238 240.0573 37.1297 46.8896 0.6855 1.4978 1.9938 1.5413 0.9322 28.4681 19.9053 11.1705 5.4191 177.1255 152.2607 96.6931 56.3064 42.6056 42.6648 9.5216 7.7427 11.7028
temp: 298.150 k
press: 1.00000 atm
elementType: 8 8 7 7 6 6 6 6 6 6 6 6 6 6 6 6 6 6 6 6 6 1 1 1 1 1 1 1 1 1 1 1 1 1 1 1 1 1 1 1 1 1 1 1 1 1 1 1 1 1 1 1 1 1 1
symmnumber: 1
zpe: 1288957.4 jmol-1
zpe.correction: 0.490938 hartree
zpe.thermalcorrener: 0.516559 hartree
zpe.thermalcorrenthalpy: 0.517503 hartree
zpe.thermalcorrgfe: 0.429638 hartree
zpe.sumelectzpe: -926.395168 hartree
zpe.sumelectthermal: -926.369548 hartree
zpe.sumelectthermalent: -926.368603 hartree
zpe.sumelectthermalfe: -926.456468 hartree
dipole: 2.7792 -1.9376 0.2660
dipole: 3.3984
quadrupole: -156.5808 -132.7790 -131.8645
quadrupole: 5.3985 -1.7987 -0.0753
quadrupole: -16.1727 7.6291 8.5436 5.3985 -1.7987 -0.0753
hfenergy: -926.8861063 hartree
pointgroup: C01 [X(C17H34N2O2)]
dipole: -1.0968501 0.7616493 0.066955 debye
polarizability: 254.8256181|1.4254461|203.0870033|-9.169061|-7.3644598|166.6389602 unknown
InChI: InChI=1S/C17H34N2O2/c1-2-3-4-5-6-7-8-9-10-11-14-21-17(18)19-12-15-20-16-13-19/h18H,2-16H2,1H3
charge 0 multiplicity 1
55 atoms
O  3.495493 1.189112 0.20609
O  5.638699 -3.224579 0.377069
N  5.160862 -0.402464 0.195828
N  5.633062 1.610621 -0.937838
C  -3.304499 1.039979 0.309309
C  -1.895443 0.943779 -0.318102
C  -4.352447 0.152392 -0.399141
C  -0.853186 1.847282 0.378362
C  -5.757673 0.236197 0.238597
C  0.56063 1.729752 -0.233402
C  -6.809164 -0.640958 -0.477892
C  1.586759 2.660672 0.44918
C  -8.211946 -0.56622 0.166371
C  3.003211 2.542966 -0.120632
C  -9.264933 -1.437869 -0.555645
C  4.357813 -1.222502 1.121401
C  6.502752 -0.939499 -0.100974
C  4.291254 -2.67015 0.594334
C  6.3760 -2.39134 -0.59401
C  4.815119 0.870296 -0.23159
C  -10.661525 -1.362872 0.098822
H  -3.247941 0.75575 1.381066
H  -3.644683 2.096693 0.286247
H  -1.95399 1.213652 -1.393384
H  -1.549669 -0.110525 -0.281462
H  -4.417478 0.444818 -1.468219
H  -4.007652 -0.902961 -0.386891
H  -1.192348 2.903567 0.325705
H  -0.807395 1.589508 1.457279
H  -5.694161 -0.065721 1.305134
H  -6.099122 1.29275 0.235409
H  0.913507 0.682928 -0.15767
H  0.513294 1.968921 -1.316657
H  -6.878422 -0.33351 -1.542547
H  -6.464407 -1.696465 -0.481966
H  1.263007 3.715797 0.33593
H  1.623147 2.452572 1.536328
H  -8.556449 0.489355 0.175861
H  -8.145231 -0.879898 1.229363
H  2.996572 2.679341 -1.222481
H  3.681001 3.295189 0.331544
H  -8.917565 -2.491337 -0.569061
H  -9.334329 -1.120664 -1.616352
H  3.347946 -0.795926 1.212688
H  4.832786 -1.225564 2.126189
H  7.126197 -0.914554 0.817842
H  6.969407 -0.290091 -0.859259
H  3.815498 -3.337614 1.332159
H  3.71807 -2.695472 -0.358256
H  5.852192 -2.411273 -1.57423
H  7.366251 -2.865708 -0.692715
H  -11.043716 -0.324403 0.098567
H  -11.395652 -1.993262 -0.436103
H  -10.624655 -1.704996 1.150453
H  5.265753 2.522209 -1.247847
