program: Gaussian 09
title: 000239301
version: EM64L-G09RevD.01
frameworkgroup: C1[X(C11H12Cl2N2)]
method: RPBEPBE
basis: SDD
operation: Freq
keyword: #p
keyword: freq=noraman
keyword: PBEPBE/SDD
title: #p freq=noraman PBEPBE/SDD
converged: YES YES NO NO
title: Mulliken charges:
elementType: Cl Cl N N C C C C C C C C C C C H H H H H H H H H H H H
charge: -0.032378 -0.019962 -0.137401 -0.650129 0.271944 0.274177 0.133023 -0.805764 -0.373348 -0.392928 -0.263777 -0.033830 -0.180891 -0.142586 -0.738117 0.281730 0.213139 0.230042 0.288864 0.258589 0.207469 0.255794 0.232308 0.233920 0.228402 0.318749 0.342963
chargesum: 0.00000
title: Mulliken charges with hydrogens summed into heavy atoms:
elementType: Cl Cl N N C C C C C C C C C C C
charge: -0.032378 -0.019962 -0.137401 0.011582 0.271944 0.274177 0.133023 -0.080854 -0.084484 -0.134339 -0.056307 -0.033830 0.074903 -0.142586 -0.043486
polarizability: 2.82621145e+02 7.51174145e+00 1.36646115e+02 -8.65204060e+00 -2.39659380e+00 9.52609461e+01
1716.lowfreq: -10.4099 -2.9228 -0.0015 0.0016 0.0028 4.4310 27.5523 42.9073 49.0275
frequency: 27.3004 42.8892 49.0088 71.5758 84.7426 96.7526 117.0720 163.5131 181.7695 188.5809 224.1988 259.2169 279.4472 318.2636 349.6566 392.2501 408.3437 429.7891 439.9211 444.7946 470.8486 505.2477 540.4076 564.2770 597.7703 650.1532 672.2059 686.8009 694.1434 759.3017 818.6158 843.5246 861.8020 870.2153 940.1845 947.9839 992.1663 1009.9968 1036.9246 1045.2431 1050.2734 1096.7522 1114.1892 1130.0210 1176.7719 1230.4786 1264.4513 1328.8297 1342.0560 1373.3901 1390.9984 1397.5926 1398.2658 1449.8682 1452.8642 1463.5804 1469.0200 1481.3355 1540.5760 1586.0392 1594.9061 1627.0655 1666.6758 2969.3968 2982.0181 3036.2509 3066.8733 3078.5284 3104.6464 3111.5923 3157.3607 3158.7728 3177.7572 3535.3408 3681.5357
redmass: 4.3981 4.2508 5.1315 2.0261 1.4819 1.0861 5.6009 4.7008 8.3454 5.9473 4.8971 4.0606 5.6368 4.5440 3.0564 6.7052 3.1624 4.3475 3.1742 2.9791 1.6159 1.9665 1.4921 4.0300 3.9011 5.7459 7.1022 4.6986 3.6743 2.9998 1.4265 4.2975 1.3698 1.4968 1.7441 1.3452 5.0058 1.7598 1.4786 1.6643 1.6558 2.3594 2.3300 1.3417 2.3687 1.8168 2.2716 4.5965 1.6112 1.9491 3.9922 1.2319 1.8437 2.2983 1.1439 1.0517 1.0567 1.0726 7.7672 4.4991 3.2591 1.7445 5.8356 1.0391 1.0405 1.0963 1.0922 1.0886 1.0978 1.0977 1.0882 1.0918 1.0973 1.0453 1.1032
irintensity: 0.6587 0.3914 0.6020 1.0656 0.9297 0.8135 0.5935 2.5513 0.5964 2.5538 3.7866 1.5408 0.3779 2.2287 3.0798 11.8277 1.6517 4.3076 25.0578 11.4087 119.6432 79.3027 30.3455 11.1303 7.4148 19.5592 8.1714 10.8576 5.9146 31.9009 31.2376 60.9412 11.9128 17.7276 5.5610 0.5044 27.2148 56.3589 5.9638 14.2118 0.2392 18.0787 65.6579 2.4200 20.0654 19.9320 24.2144 10.7208 28.5259 59.3259 2.8781 27.0245 17.7208 151.8730 12.4626 18.8548 17.2973 6.3445 40.7434 353.3907 85.2145 367.0229 34.5485 36.3519 24.8917 20.1183 18.4169 8.1017 19.2877 36.1802 2.8273 0.9331 4.2408 22.4689 28.3202
temp: 298.150 k
press: 1.00000 atm
elementType: 17 17 7 7 6 6 6 6 6 6 6 6 6 6 6 1 1 1 1 1 1 1 1 1 1 1 1
symmnumber: 1
zpe: 536901.8 jmol-1
zpe.correction: 0.204495 hartree
zpe.thermalcorrener: 0.220649 hartree
zpe.thermalcorrenthalpy: 0.221593 hartree
zpe.thermalcorrgfe: 0.158953 hartree
zpe.sumelectzpe: -1454.880851 hartree
zpe.sumelectthermal: -1454.864697 hartree
zpe.sumelectthermalent: -1454.863752 hartree
zpe.sumelectthermalfe: -1454.926393 hartree
dipole: 5.4262 0.8030 -2.0601
dipole: 5.8594
quadrupole: -98.1271 -98.7363 -101.0053
quadrupole: 8.3951 -2.8288 -2.0337
quadrupole: 1.1625 0.5532 -1.7157 8.3951 -2.8288 -2.0337
hfenergy: -1455.0853457 hartree
pointgroup: C01 [X(C11H12Cl2N2)]
dipole: 2.1491553 -0.3305931 -0.7655495 debye
polarizability: 283.0271462|-1.1686039|115.4296671|-8.0535273|-20.7627547|116.0713926 unknown
InChI: InChI=1S/C11H12Cl2N2/c1-3-7(2)11(14)15-8-4-5-9(12)10(13)6-8/h3-6H,14H2,1-2H3
charge 0 multiplicity 1
27 atoms
Cl -3.537197 1.930053 -1.364682
Cl -5.190317 -0.582501 -0.006613
N  0.833898 -0.190854 0.651739
N  1.457306 -0.100913 -1.662285
C  3.172051 0.165519 0.101033
C  -0.55314 -0.286988 0.409086
C  1.73962 -0.043809 -0.301056
C  3.372035 0.79172 1.466237
C  -1.275688 0.70698 -0.320549
C  -1.287036 -1.351296 1.008223
C  4.184684 -0.227364 -0.733038
C  -2.675034 0.622797 -0.439982
C  -2.684897 -1.431822 0.867628
C  -3.3885 -0.445884 0.141493
C  5.667895 -0.077466 -0.49768
H  2.602015 0.401059 2.152696
H  4.371417 0.585889 1.881095
H  3.234335 1.889679 1.423879
H  -0.749505 1.561273 -0.757167
H  -0.74274 -2.101505 1.588618
H  3.922217 -0.750964 -1.665597
H  -3.241422 -2.254837 1.325699
H  5.902074 0.481706 0.421919
H  6.157475 -1.06928 -0.43257
H  6.144135 0.451589 -1.346558
H  2.163115 0.142397 -2.351497
H  0.515704 -0.323479 -1.981472
