program: Gaussian 09
title: 000239300
version: EM64L-G09RevD.01
frameworkgroup: C1[X(C11H20N2O2)]
method: RPBEPBE
basis: SDD
operation: Freq
keyword: #p
keyword: freq=noraman
keyword: PBEPBE/SDD
title: #p freq=noraman PBEPBE/SDD
converged: YES YES NO NO
title: Mulliken charges:
elementType: O O N N C C C C C C C C C C C H H H H H H H H H H H H H H H H H H H H
charge: -0.343247 -0.247359 -0.171368 -0.409477 0.030332 -0.449400 -0.440481 -0.384480 -0.392294 -0.382268 -0.358853 -0.357929 0.263570 -0.301832 -0.297163 0.254103 0.251462 0.192583 0.191910 0.210692 0.205089 0.194467 0.195937 0.202578 0.187776 0.197989 0.258126 0.215747 0.229807 0.201639 0.219085 0.195519 0.194500 0.220292 0.222947
chargesum: 0.00000
title: Mulliken charges with hydrogens summed into heavy atoms:
elementType: O O N N C C C C C C C C C C C
charge: -0.343247 -0.247359 -0.171368 -0.186530 0.284436 -0.005355 -0.037879 0.015077 0.006222 0.003497 0.115019 0.073518 0.263570 0.112771 0.117630
polarizability: 1.62010933e+02 -9.08827444e-01 1.36833423e+02 -1.71826750e+00 4.00478448e+00 1.10307776e+02
1716.lowfreq: -8.8656 -0.0005 0.0004 0.0006 7.5659 9.9283 32.5802 35.1003 67.5612
frequency: 31.1890 35.0807 67.4767 73.8566 91.3172 155.1408 192.5714 221.4005 234.3235 253.2430 297.9712 331.3931 358.3266 379.7003 390.5250 449.1857 463.0819 466.3393 484.5896 532.5766 617.8399 645.3943 668.1575 685.9852 761.4785 773.5457 799.2141 800.8533 815.2035 835.2294 864.2308 872.6234 890.2659 912.5716 924.4066 971.4787 979.9302 1011.9921 1016.4160 1047.1849 1051.0872 1051.6127 1075.2734 1086.1890 1090.1401 1114.2618 1121.7707 1127.7550 1163.2516 1184.1855 1194.8684 1232.0698 1235.6552 1257.9104 1258.4886 1267.9919 1277.2450 1309.4491 1320.1432 1327.7101 1331.8581 1336.7450 1343.0918 1344.5969 1358.0160 1359.2455 1361.6418 1369.5669 1394.7392 1444.4158 1449.3604 1450.2246 1451.8527 1461.1299 1461.3659 1462.2361 1469.3214 1476.3931 1600.2898 2942.6885 2946.2973 2955.8668 2960.7167 2960.8795 2974.1005 2978.6178 2980.2988 2981.8253 3025.9553 3034.9982 3039.9886 3045.0349 3049.9691 3051.6993 3062.8061 3082.3117 3086.5052 3108.1033 3432.7201
redmass: 3.1150 3.9337 3.7981 3.9204 4.4138 3.6720 2.5135 1.9543 3.3551 2.9726 2.3373 3.2147 2.3821 1.9566 2.4949 2.8307 2.6937 2.9251 2.4681 2.9470 2.3012 2.7110 6.5679 1.2306 3.5988 1.5421 3.7160 3.3907 2.7026 1.6684 2.2512 1.8592 2.3622 2.2008 1.4214 1.9493 3.1664 2.7734 2.3036 1.4115 1.8935 1.7635 3.8437 1.7753 1.9874 1.0762 1.9314 2.1085 1.7379 2.8535 1.1021 1.4513 1.4362 1.4920 1.3426 1.2325 1.2183 1.4895 1.5333 1.2380 1.4092 1.4387 1.4536 1.2695 1.4689 1.4447 1.4619 1.2890 2.3756 1.0833 1.0848 1.0898 1.0959 1.0850 1.0971 1.0878 1.0813 1.0947 7.1279 1.0695 1.0701 1.0652 1.0631 1.0659 1.0654 1.0615 1.0621 1.0636 1.0954 1.0999 1.0952 1.0925 1.1017 1.0938 1.0965 1.0966 1.0981 1.0912 1.0768
irintensity: 0.1079 0.0543 1.8405 3.4672 0.1193 1.9057 5.2171 3.9063 3.9750 13.5329 2.6184 5.7460 2.4994 2.9849 2.5645 0.3349 6.4265 4.1220 0.9422 6.0715 11.7421 1.4002 34.5030 50.2021 11.9196 2.2839 11.2296 5.1868 21.7862 0.3025 12.5454 13.0424 40.5158 14.9507 8.0515 251.4250 14.8154 25.2702 10.5599 1.0001 9.9115 24.6238 35.3285 8.7736 2.9100 0.6973 13.0971 18.6261 8.7013 20.7383 4.3437 175.0234 199.8746 34.6215 18.5285 2.4197 20.3105 13.1170 5.7563 0.9563 1.7211 1.0251 11.9707 3.2452 5.1676 9.8002 18.6681 3.3794 223.7810 4.8860 7.6392 15.9694 10.6903 4.1245 9.3097 11.5298 18.3289 6.1714 249.2930 56.9748 29.8315 22.9251 78.1570 91.7075 8.2285 52.3130 21.2732 35.2602 72.2527 57.0156 7.2647 38.4472 88.3827 32.4392 34.8589 38.8018 37.4818 6.6306 23.4732
temp: 298.150 k
press: 1.00000 atm
elementType: 8 8 7 7 6 6 6 6 6 6 6 6 6 6 6 1 1 1 1 1 1 1 1 1 1 1 1 1 1 1 1 1 1 1 1
symmnumber: 1
zpe: 800169.1 jmol-1
zpe.correction: 0.304768 hartree
zpe.thermalcorrener: 0.319393 hartree
zpe.thermalcorrenthalpy: 0.320338 hartree
zpe.thermalcorrgfe: 0.262134 hartree
zpe.sumelectzpe: -689.889491 hartree
zpe.sumelectthermal: -689.874865 hartree
zpe.sumelectthermalent: -689.873921 hartree
zpe.sumelectthermalfe: -689.932125 hartree
dipole: -0.1110 -0.3555 0.0932
dipole: 0.3839
quadrupole: -91.5093 -93.0980 -90.7028
quadrupole: -8.6931 -1.8226 1.1314
quadrupole: 0.2607 -1.3280 1.0673 -8.6931 -1.8226 1.1314
hfenergy: -690.1942589 hartree
pointgroup: C01 [X(C11H20N2O2)]
dipole: -0.0452983 0.1435623 0.0121743 debye
polarizability: 162.0255366|1.5102894|131.8195123|-1.2247894|11.1000678|115.3070829 unknown
InChI: InChI=1S/C11H20N2O2/c12-11(13-6-8-14-9-7-13)15-10-4-2-1-3-5-10/h10,12H,1-9H2
charge 0 multiplicity 1
35 atoms
O  0.629081 -0.32636 0.28602
O  -4.062415 1.182962 0.404684
N  -1.660356 -0.384721 0.15059
N  -0.293756 -2.237085 -0.717474
C  1.990248 -0.910593 0.03256
C  2.427255 -0.598808 -1.412578
C  2.91368 -0.266049 1.079447
C  2.626925 0.916178 -1.648657
C  3.120016 1.24843 0.833551
C  3.602966 1.523563 -0.61153
C  -1.708079 0.766103 1.082376
C  -2.974611 -0.994168 -0.12105
C  -0.47256 -1.076128 -0.134086
C  -2.734043 1.798363 0.585756
C  -3.970961 0.091327 -0.576199
H  1.89843 -2.002551 0.172622
H  1.685218 -1.027069 -2.109078
H  3.384873 -1.131016 -1.591234
H  3.891966 -0.78619 1.022826
H  2.505135 -0.448235 2.091009
H  1.64694 1.427291 -1.568501
H  2.999564 1.089613 -2.676704
H  3.845295 1.651688 1.566529
H  2.160016 1.774875 1.002822
H  4.610253 1.077469 -0.7525
H  3.709679 2.6134 -0.776781
H  -0.705204 1.213149 1.145672
H  -2.003614 0.418229 2.096119
H  -3.365805 -1.499306 0.788693
H  -2.883319 -1.750561 -0.921102
H  -2.881063 2.599175 1.328929
H  -2.392665 2.237544 -0.376518
H  -3.652956 0.496817 -1.561316
H  -4.99035 -0.321118 -0.655469
H  -1.156082 -2.754716 -0.949126
