program: Gaussian 09
title: 000239299
version: EM64L-G09RevD.01
frameworkgroup: C1[X(C11H20N2O)]
method: RPBEPBE
basis: SDD
operation: Freq
keyword: #p
keyword: freq=noraman
keyword: PBEPBE/SDD
title: #p freq=noraman PBEPBE/SDD
converged: YES YES NO NO
title: Mulliken charges:
elementType: O N N C C C C C C C C C C C H H H H H H H H H H H H H H H H H H H H
charge: -0.331644 -0.168413 -0.428979 0.028846 -0.449367 -0.440355 -0.383979 -0.391939 -0.381886 -0.391682 -0.351419 -0.452036 -0.447736 0.256216 0.251194 0.252058 0.189975 0.189481 0.208593 0.205339 0.191838 0.192455 0.208665 0.185882 0.195783 0.225198 0.233967 0.218415 0.245408 0.229189 0.224270 0.227494 0.222061 0.237110
chargesum: 0.00000
title: Mulliken charges with hydrogens summed into heavy atoms:
elementType: O N N C C C C C C C C C C C
charge: -0.331644 -0.168413 -0.191869 0.280040 -0.007334 -0.042281 0.013197 0.009180 -0.000220 0.067483 0.112405 0.001423 0.001818 0.256216
polarizability: 1.57816935e+02 5.96759858e-01 1.31845338e+02 -3.22360460e+00 -1.26268360e-01 1.06570416e+02
1716.lowfreq: -8.5858 0.0006 0.0008 0.0010 4.4179 12.4970 33.9232 43.2800 68.2295
frequency: 33.6405 43.1648 68.1461 81.3141 107.8871 150.5181 173.1159 193.5488 234.1312 242.5886 277.1315 337.5308 361.2751 407.2849 457.9589 467.6427 500.1692 568.9630 641.7722 663.5751 674.4639 683.5410 770.2682 783.1648 798.5333 816.1432 860.8011 863.9218 865.6199 873.4193 894.5460 911.8342 923.9498 925.2875 977.2687 983.2329 1011.8527 1046.3072 1047.6273 1051.4835 1086.6718 1105.4745 1112.6662 1123.7889 1134.6067 1153.1121 1163.3217 1173.7043 1186.0335 1219.0788 1234.9245 1241.5972 1256.5436 1266.7544 1300.3798 1302.6927 1313.1668 1319.5297 1329.6273 1333.7341 1336.7082 1339.4710 1342.8135 1357.9191 1360.3400 1396.0835 1450.5236 1459.5618 1459.7547 1466.8954 1467.4717 1472.4104 1474.7404 1493.1899 1501.5211 1604.3058 2940.8605 2957.9558 2968.0516 2972.3273 2976.5057 2977.9990 2981.5691 2997.3261 3009.3163 3016.3713 3023.1050 3033.4836 3036.5993 3041.7517 3048.9964 3061.3901 3061.8561 3076.8774 3090.7607 3421.0528
redmass: 3.3003 3.0080 3.3379 3.3533 3.8889 3.4434 2.6640 2.5255 1.6857 3.1795 2.7339 2.2089 2.5116 2.7298 2.7862 2.3323 3.2323 1.8373 2.8978 3.2135 2.0681 2.2114 1.5101 2.5067 2.9635 2.5272 1.8516 1.9648 2.2413 1.8303 2.3843 2.5390 1.3895 1.3919 1.6520 2.2381 2.7869 1.8592 1.5203 1.6557 1.6028 1.5603 1.0644 2.0241 1.8631 1.4628 1.7198 1.8414 2.6791 1.2853 1.3050 1.3777 1.2591 1.2485 1.3947 1.4049 1.2423 1.5685 1.4220 1.5042 1.4532 1.5084 1.5396 1.5067 1.4381 3.5148 1.0845 1.0883 1.0881 1.0879 1.0816 1.0962 1.0954 1.0788 1.0922 7.7333 1.0630 1.0624 1.0690 1.0648 1.0627 1.0621 1.0629 1.0914 1.0625 1.0713 1.0955 1.1001 1.0925 1.0948 1.1019 1.0965 1.0949 1.1010 1.1055 1.0766
irintensity: 1.7123 0.0771 0.3614 1.8498 0.1301 2.6861 3.9011 1.9649 0.3577 4.7631 6.7584 4.7524 4.4932 0.2261 5.2581 3.2885 0.3738 4.9428 0.4834 59.0480 15.2772 18.2337 0.4566 4.2334 2.0213 8.2393 4.9172 18.2253 2.8647 10.2648 31.6544 11.6083 6.0349 4.1637 8.5307 257.3600 23.8063 1.5076 2.9152 5.8338 2.1078 8.1015 1.6377 9.8040 26.4607 10.2767 7.2534 23.8819 7.4616 25.6203 8.7234 9.7554 2.5713 21.5269 72.5763 22.8835 0.2274 7.1736 2.8224 5.4070 1.7869 5.2548 21.2217 10.2124 33.8722 360.1731 9.8750 4.7243 14.9835 9.0108 17.8571 10.5293 6.0592 1.5425 5.7569 290.4614 65.7891 42.2796 41.6918 7.0356 56.0752 25.3193 36.3187 14.7326 32.0297 53.4384 76.4927 58.2331 4.1762 39.8849 89.3600 26.7243 29.6236 30.2696 62.5659 26.0562
temp: 298.150 k
press: 1.00000 atm
elementType: 8 7 7 6 6 6 6 6 6 6 6 6 6 6 1 1 1 1 1 1 1 1 1 1 1 1 1 1 1 1 1 1 1 1
symmnumber: 1
zpe: 788398.3 jmol-1
zpe.correction: 0.300285 hartree
zpe.thermalcorrener: 0.314257 hartree
zpe.thermalcorrenthalpy: 0.315201 hartree
zpe.thermalcorrgfe: 0.258559 hartree
zpe.sumelectzpe: -614.768129 hartree
zpe.sumelectthermal: -614.754157 hartree
zpe.sumelectthermalent: -614.753213 hartree
zpe.sumelectthermalfe: -614.809855 hartree
dipole: -2.4557 -1.7175 0.3857
dipole: 3.0215
quadrupole: -72.2423 -89.0840 -86.0759
quadrupole: -0.0731 -1.7002 0.9209
quadrupole: 10.2251 -6.6166 -3.6085 -0.0731 -1.7002 0.9209
hfenergy: -615.0684142 hartree
pointgroup: C01 [X(C11H20N2O1)]
dipole: 0.9665574 -0.6835917 0.1075418 debye
polarizability: 158.0008663|-0.9519147|129.667847|-0.2166313|-7.144642|108.5639757 unknown
InChI: InChI=1S/C11H20N2O/c12-11(13-8-4-5-9-13)14-10-6-2-1-3-7-10/h10,12H,1-9H2
charge 0 multiplicity 1
34 atoms
O  -0.360543 0.143648 0.281842
N  1.905069 0.127355 0.007976
N  0.639263 2.178242 -0.377621
C  -1.685227 0.849511 0.278501
C  -2.248646 0.895139 -1.156067
C  -2.580159 0.046551 1.237406
C  -2.591467 -0.512532 -1.696078
C  -2.923581 -1.358978 0.687307
C  -3.535845 -1.27165 -0.731864
C  3.238316 0.658678 -0.343009
C  1.945046 -1.284496 0.464252
C  4.145622 -0.597102 -0.312153
C  3.452039 -1.521143 0.723333
C  0.761999 0.908889 -0.058863
H  -1.501236 1.876591 0.642246
H  -1.523421 1.416617 -1.80514
H  -3.168447 1.516408 -1.132321
H  -3.515456 0.625516 1.383483
H  -2.084357 -0.027943 2.223395
H  -1.655065 -1.092854 -1.817073
H  -3.051842 -0.427524 -2.699649
H  -3.620291 -1.872432 1.378165
H  -1.997013 -1.964628 0.64724
H  -4.509499 -0.739636 -0.679362
H  -3.745962 -2.287427 -1.120211
H  3.573456 1.417437 0.396291
H  3.230293 1.139801 -1.34093
H  1.556005 -1.965304 -0.31996
H  1.320908 -1.421196 1.363096
H  5.186523 -0.351294 -0.042597
H  4.152797 -1.080695 -1.306145
H  3.735559 -2.581162 0.608972
H  3.713167 -1.203806 1.749825
H  1.533491 2.659417 -0.569182
