program: Gaussian 09
title: 000239297
version: EM64L-G09RevD.01
frameworkgroup: C1[X(C15H24N2O)]
method: RPBEPBE
basis: SDD
operation: Freq
keyword: #p
keyword: freq=noraman
keyword: PBEPBE/SDD
title: #p freq=noraman PBEPBE/SDD
converged: YES YES NO NO
title: Mulliken charges:
elementType: O N N C C C C C C C C C C C C C C C H H H H H H H H H H H H H H H H H H H H H H H H
charge: -0.333528 -0.383913 -0.120323 -0.336363 -0.383133 -0.337945 -0.330097 -0.476561 -0.349009 0.232860 -0.691400 -0.688905 0.368635 -0.409307 -0.315837 -0.198934 -0.218823 -0.254593 0.228091 0.182203 0.231303 0.203199 0.196847 0.188762 0.185678 0.207490 0.226887 0.157972 0.223646 0.169468 0.310192 0.209624 0.215862 0.214667 0.214941 0.206059 0.214382 0.245537 0.322314 0.224804 0.222209 0.225038
chargesum: 0.00000
title: Mulliken charges with hydrogens summed into heavy atoms:
elementType: O N N C C C C C C C C C C C C C C C
charge: -0.333528 -0.073721 -0.120323 0.073931 0.051369 0.047664 0.063071 -0.091702 0.044106 0.232860 -0.051246 -0.053523 0.368635 -0.163770 0.006477 0.025869 0.003386 -0.029555
polarizability: 2.18377350e+02 -2.72855593e+00 2.07325294e+02 -1.58553532e+01 -1.14729648e-02 1.24617230e+02
1716.lowfreq: -9.5049 -2.4429 -0.0005 0.0002 0.0005 0.3418 18.4413 19.0148 20.7165
frequency: 18.4185 18.9655 20.6102 26.8449 61.2467 74.1152 80.3150 96.0890 103.7149 120.9475 155.2726 184.1230 191.4451 225.5813 234.6271 236.9898 250.7355 256.5706 294.5932 353.9915 369.4512 388.7597 412.4335 427.6042 475.8745 497.5345 517.4309 599.3712 621.0588 639.3485 641.6465 694.8954 719.8660 735.4764 748.2849 760.5590 784.7108 826.5074 843.0237 843.0526 884.4630 898.4699 920.1536 937.3187 951.1304 968.9865 973.9132 985.5621 997.0194 1003.1036 1020.4372 1039.9393 1069.6763 1070.6198 1080.0404 1080.4472 1112.6590 1115.1964 1135.0161 1155.9215 1165.2226 1167.1462 1204.4910 1220.4750 1229.7101 1249.5076 1265.4025 1279.7624 1286.5530 1289.4780 1300.6585 1306.2574 1320.5702 1331.9087 1344.9749 1357.7208 1366.1193 1384.1649 1388.7571 1389.7364 1433.0444 1441.0927 1449.9393 1460.8786 1468.4442 1468.9444 1473.5629 1476.1952 1477.7265 1478.4822 1484.6758 1487.9936 1500.8505 1589.1854 1606.5608 1653.7038 2875.1880 2944.8755 2961.9675 2971.4892 2973.1070 2973.8637 2975.4232 2987.3392 3007.3657 3010.2670 3012.8633 3041.7384 3042.9282 3068.7541 3071.0037 3072.8056 3073.1265 3075.8355 3125.8792 3136.2352 3153.6804 3167.4180 3197.0825 3581.0010
redmass: 3.7878 3.9236 4.0209 3.6984 1.8806 3.6106 3.1792 1.6416 2.6364 3.0910 3.0506 3.3841 3.3046 1.3481 1.8626 1.4221 2.9902 2.6448 3.2781 3.7330 3.4126 1.6220 2.9896 2.0356 3.6061 2.9931 2.6606 5.6958 4.9719 9.5666 5.4045 2.3559 3.1662 1.1013 1.3245 1.5049 1.2744 1.9763 1.7649 1.2597 2.1153 1.7493 1.3905 1.3797 1.3299 2.3637 1.3393 5.9197 1.2929 3.9681 2.0510 3.7484 2.2499 1.6423 2.6314 2.1324 2.3389 1.9977 1.8443 1.4108 2.2782 1.0630 2.2326 1.5516 1.4054 1.2689 1.3597 1.5667 1.1574 1.1778 1.2321 1.3087 1.5288 1.3708 1.5021 1.4946 1.3815 8.4590 1.2203 1.2114 1.3600 2.3058 1.1034 1.1315 1.2954 1.5785 1.0629 1.0442 1.0677 1.0423 1.0745 1.0824 1.0954 6.6563 6.3030 6.6153 1.0701 1.0643 1.0590 1.0593 1.0422 1.0383 1.0561 1.0666 1.0975 1.0911 1.0906 1.1024 1.0976 1.1004 1.1006 1.0995 1.0995 1.1018 1.0849 1.0898 1.0944 1.1000 1.0948 1.0760
irintensity: 0.2761 0.2040 0.0830 0.1887 0.7437 0.1229 3.1380 0.3354 0.3600 1.2436 0.4729 0.0637 0.0911 0.1128 0.0593 0.2433 1.6371 0.2608 3.5474 2.6519 3.3719 34.3092 0.5926 64.8929 3.2952 3.0698 7.5253 6.0178 15.9875 18.0454 2.1511 28.0753 1.3860 8.7436 8.7421 94.2912 1.2623 1.1841 4.0260 0.0454 9.0955 9.0871 9.6165 22.9943 9.1820 4.0862 0.0989 0.2071 2.6536 4.2160 16.9004 1.0251 10.0072 12.5092 2.4257 56.8073 14.8576 4.0152 2.9698 73.1521 17.2349 0.0260 179.0656 128.2412 3.2582 15.0620 46.7918 176.5098 0.1636 62.3413 6.6021 1.8149 144.6580 26.7130 11.1006 21.1094 14.7616 30.3242 9.5881 12.3858 17.1520 7.6338 7.5677 55.5479 45.7348 71.0332 1.8967 11.6606 6.1226 14.5012 10.7044 13.7919 23.4409 31.2488 45.1708 549.4981 100.0600 48.2272 25.0224 29.3542 24.3280 54.8395 42.1091 71.2347 11.7135 25.3285 45.8042 33.6657 20.4780 15.9203 74.3860 68.8128 25.9230 106.0188 0.7218 18.3809 33.7277 15.0265 20.4134 20.1107
temp: 298.150 k
press: 1.00000 atm
elementType: 8 7 7 6 6 6 6 6 6 6 6 6 6 6 6 6 6 6 1 1 1 1 1 1 1 1 1 1 1 1 1 1 1 1 1 1 1 1 1 1 1 1
symmnumber: 1
zpe: 952546.2 jmol-1
zpe.correction: 0.362806 hartree
zpe.thermalcorrener: 0.383171 hartree
zpe.thermalcorrenthalpy: 0.384115 hartree
zpe.thermalcorrgfe: 0.309927 hartree
zpe.sumelectzpe: -769.302781 hartree
zpe.sumelectthermal: -769.282416 hartree
zpe.sumelectthermalent: -769.281472 hartree
zpe.sumelectthermalfe: -769.355660 hartree
dipole: 2.3889 1.1788 -0.6581
dipole: 2.7440
quadrupole: -101.1363 -103.6705 -113.5490
quadrupole: -1.2997 -5.3591 -1.1870
quadrupole: 4.9823 2.4481 -7.4304 -1.2997 -5.3591 -1.1870
hfenergy: -769.6655866 hartree
pointgroup: C01 [X(C15H24N2O1)]
dipole: -0.8404871 0.6671279 -0.1183572 debye
polarizability: 204.8730147|-7.367977|214.69707|-14.0745407|-22.9294815|130.7497886 unknown
InChI: InChI=1S/C15H24N2O/c1-3-5-12-16-15(17-13-6-4-2)18-14-10-8-7-9-11-14/h7-11,16H,3-6,12-13H2,1-2H3
charge 0 multiplicity 1
42 atoms
O  -0.177963 -0.844113 -0.382785
N  -1.302599 0.99244 -1.11646
N  1.120575 0.919503 -1.315912
C  -3.025193 0.411315 0.654584
C  -2.584195 0.324607 -0.826171
C  -4.380999 -0.289587 0.897907
C  1.705679 3.350448 -1.063909
C  1.232416 2.217593 -2.009847
C  0.671686 3.749037 0.013036
C  -0.036554 0.427901 -0.978426
C  -4.837544 -0.209884 2.370778
C  1.187015 4.865952 0.945957
C  0.843634 -1.818187 -0.218491
C  0.34475 -3.05782 0.250461
C  2.226541 -1.629529 -0.451352
C  1.235922 -4.124446 0.485218
C  3.102774 -2.714768 -0.212789
C  2.62286 -3.959224 0.252586
H  -2.242115 -0.053761 1.283012
H  -3.095602 1.475941 0.958725
H  -2.499705 -0.735196 -1.121852
H  -3.356669 0.787208 -1.472768
H  -4.302037 -1.353068 0.592552
H  -5.155538 0.164989 0.245828
H  1.961015 4.238015 -1.67934
H  2.63925 3.020074 -0.567796
H  1.990267 2.093977 -2.80717
H  0.291252 2.540276 -2.51975
H  0.409971 2.856529 0.614711
H  -0.262244 4.090737 -0.484587
H  -1.324572 1.987139 -1.336167
H  -4.954392 0.841998 2.693211
H  -5.806546 -0.719889 2.52283
H  -4.095983 -0.684346 3.040369
H  2.101384 4.541599 1.47712
H  1.438113 5.778984 0.373465
H  0.433241 5.139289 1.707014
H  -0.73099 -3.16427 0.422652
H  2.576734 -0.66153 -0.810415
H  0.847141 -5.082774 0.847375
H  4.174977 -2.575654 -0.3935
H  3.315743 -4.788003 0.434099
