program: Gaussian 09
title: 000239296
version: EM64L-G09RevD.01
frameworkgroup: C1[X(C13H28N2O)]
method: RPBEPBE
basis: SDD
operation: Freq
keyword: #p
keyword: freq=noraman
keyword: PBEPBE/SDD
title: #p freq=noraman PBEPBE/SDD
converged: YES YES NO NO
title: Mulliken charges:
elementType: O N N C C C C C C C C C C C C C H H H H H H H H H H H H H H H H H H H H H H H H H H H H
charge: -0.286551 -0.383478 -0.129696 -0.342517 -0.413111 -0.349891 -0.372623 -0.362684 -0.292299 -0.451088 0.260097 -0.343458 -0.326953 -0.686195 -0.684917 -0.693267 0.185401 0.243330 0.197530 0.243168 0.194023 0.185051 0.210703 0.211077 0.185756 0.196135 0.220066 0.182299 0.197430 0.212617 0.304640 0.191801 0.193899 0.217068 0.184776 0.216061 0.212091 0.208037 0.213306 0.217373 0.212563 0.203920 0.212250 0.206259
chargesum: 0.00000
title: Mulliken charges with hydrogens summed into heavy atoms:
elementType: O N N C C C C C C C C C C C C C
charge: -0.286551 -0.078838 -0.129696 0.086214 0.027587 0.029184 0.049157 0.019207 0.110066 -0.041041 0.260097 0.042243 0.074892 -0.050007 -0.041675 -0.070838
polarizability: 1.80432738e+02 3.66430049e+00 1.77611697e+02 -2.45107190e+00 8.25278432e+00 1.36684235e+02
1716.lowfreq: -10.4444 -4.8592 -0.0008 -0.0004 0.0004 2.4246 11.5936 17.1629 28.6742
frequency: 6.0977 16.8445 28.5581 44.8180 49.0526 67.0768 67.8882 78.2791 88.1584 108.2722 122.0586 130.6090 146.8320 167.2637 193.0275 227.6000 234.9334 236.7893 237.8446 264.1472 287.7737 316.1260 338.6139 370.4220 392.8461 425.7197 499.2390 518.8279 550.7254 612.3559 662.3186 721.7230 743.5114 745.0255 758.8945 814.9826 818.8005 829.1830 851.5949 860.9730 902.1934 933.7682 938.9429 945.6140 965.0779 972.4884 988.0025 1030.2027 1038.9635 1046.8586 1071.8676 1083.0548 1093.0880 1115.6493 1120.3826 1122.8993 1133.7155 1141.8698 1148.1472 1206.1394 1212.4765 1227.9428 1237.4198 1254.8792 1262.1959 1272.4581 1281.0782 1284.9292 1285.6651 1287.4920 1304.8934 1310.9554 1337.5713 1345.1558 1347.5168 1357.8354 1363.9712 1377.5041 1388.6368 1389.0929 1393.4863 1440.4454 1456.8091 1462.5441 1468.0405 1471.9161 1474.2233 1474.2871 1476.1108 1476.4544 1478.2408 1478.5946 1479.9587 1485.1269 1486.3932 1486.9404 1491.6628 1672.3197 2930.6570 2953.5719 2956.1727 2966.2030 2966.2602 2968.9682 2972.6832 2974.5281 2974.8439 2976.4138 2987.9399 2995.8610 3001.5489 3007.4847 3008.4236 3011.5527 3023.9692 3037.5699 3049.6187 3060.7493 3065.7434 3066.5348 3069.1679 3070.4919 3072.9637 3075.1871 3076.2769 3567.7073
redmass: 3.6288 3.8036 3.5094 1.8333 3.6024 3.2240 2.2827 1.6002 1.9433 2.9600 1.8954 3.2420 2.9490 3.5791 3.0001 1.6455 1.1226 1.1552 1.6484 2.2444 2.3252 3.3753 3.5432 3.0065 1.3747 2.0864 2.5818 3.0038 3.7840 3.9986 6.4574 1.9220 1.1589 1.0768 1.5361 1.1534 1.8842 1.9631 1.6243 1.5579 1.7687 1.4717 1.1683 1.9776 1.5948 1.9163 2.9969 3.9172 3.5625 3.0572 2.5697 2.2371 2.7062 2.0696 2.0235 2.4272 1.8296 1.5287 2.3365 1.7849 1.4124 1.3717 1.3742 1.5511 1.3293 1.2736 1.1864 1.1066 1.0812 1.1225 1.2524 1.2322 1.3177 1.4700 1.4679 1.4908 1.3283 1.3973 1.2166 1.2126 1.2189 1.0998 1.0811 1.0999 1.1148 1.1155 1.0582 1.0657 1.0843 1.0826 1.0420 1.0495 1.0984 1.1624 1.0810 1.0934 1.1147 8.6342 1.0610 1.0591 1.0591 1.0555 1.0435 1.0546 1.0395 1.0626 1.0619 1.0363 1.0645 1.0600 1.0976 1.0978 1.0982 1.1014 1.1013 1.1016 1.0986 1.1043 1.0997 1.1003 1.0998 1.1001 1.1003 1.1015 1.0995 1.0764
irintensity: 0.1017 0.4898 0.2961 0.6755 0.8279 0.2194 0.1185 0.1196 0.2844 2.4228 2.3438 2.6873 2.1538 4.2751 0.6837 1.0341 0.1613 0.1382 1.0021 0.4737 2.7257 0.8067 1.2625 2.9488 101.2622 41.1542 19.4880 5.1705 11.7684 10.4078 9.6729 2.7774 19.7710 8.9650 10.3445 0.3427 2.7966 2.3594 5.0140 9.9239 16.0044 1.9662 2.0534 11.2349 2.5002 26.7701 145.6167 71.3225 39.7622 4.1366 46.1837 2.3766 10.2976 5.2109 6.6254 2.1264 9.3048 5.8299 43.9897 64.1928 7.9638 10.4365 9.6436 36.2637 8.5766 1.5274 2.6523 1.3650 0.3834 4.5204 3.6768 19.6055 21.2368 9.8652 1.0306 16.8207 4.8660 8.9915 11.4986 9.2195 10.2974 22.3081 3.5696 10.7769 31.5447 28.7123 4.9855 7.0875 7.9934 45.8970 12.6909 12.3236 33.8037 47.2371 20.8639 26.0468 3.7938 503.4563 51.6637 32.8881 16.1605 34.6982 60.6124 69.0333 24.4381 12.8506 83.1464 33.4192 51.6740 33.2662 21.1070 14.0458 29.8165 2.2983 34.0210 31.5520 22.9661 15.1253 75.3597 88.8522 50.7924 17.3234 81.3375 101.8636 51.8598 11.9780
temp: 298.150 k
press: 1.00000 atm
elementType: 8 7 7 6 6 6 6 6 6 6 6 6 6 6 6 6 1 1 1 1 1 1 1 1 1 1 1 1 1 1 1 1 1 1 1 1 1 1 1 1 1 1 1 1
symmnumber: 1
zpe: 1036606.4 jmol-1
zpe.correction: 0.394823 hartree
zpe.thermalcorrener: 0.416364 hartree
zpe.thermalcorrenthalpy: 0.417308 hartree
zpe.thermalcorrgfe: 0.339424 hartree
zpe.sumelectzpe: -695.549698 hartree
zpe.sumelectthermal: -695.528157 hartree
zpe.sumelectthermalent: -695.527213 hartree
zpe.sumelectthermalfe: -695.605097 hartree
dipole: -1.6152 -2.7063 -1.5414
dipole: 3.5084
quadrupole: -98.1588 -99.4570 -102.1495
quadrupole: 0.5882 -0.9141 3.0552
quadrupole: 1.7630 0.4648 -2.2278 0.5882 -0.9141 3.0552
hfenergy: -695.944521 hartree
pointgroup: C01 [X(C13H28N2O1)]
dipole: 1.1048971 0.4690102 -0.6815716 debye
polarizability: 182.1108122|-0.9041367|175.6338496|-6.8650828|-6.6123125|136.984008 unknown
InChI: InChI=1S/C13H28N2O/c1-4-7-10-14-13(15-11-8-5-2)16-12-9-6-3/h14H,4-12H2,1-3H3
charge 0 multiplicity 1
44 atoms
O  1.045671 -0.282523 0.694592
N  -0.154668 1.367797 -0.543533
N  -1.327157 -0.092373 0.897513
C  -1.909645 3.10497 0.058951
C  -1.381829 2.070081 -0.963729
C  -0.943789 4.282921 0.318712
C  3.244724 -1.16241 0.181143
C  -1.756913 -2.566297 0.90534
C  2.199724 -0.117095 -0.219257
C  -1.3714 -1.312277 1.732162
C  -0.212481 0.317017 0.373142
C  4.519862 -1.074954 -0.689964
C  -3.147956 -2.469223 0.240459
C  -1.521568 5.31668 1.309717
C  5.572809 -2.133592 -0.297096
C  -3.489538 -3.708219 -0.614472
H  -2.874566 3.500571 -0.320747
H  -2.129595 2.573068 1.003581
H  -1.17017 2.565404 -1.932261
H  -2.154107 1.298838 -1.128066
H  0.013924 3.892061 0.71999
H  -0.704789 4.785067 -0.64269
H  3.505801 -1.019824 1.247266
H  2.793208 -2.16897 0.091953
H  -1.732337 -3.448995 1.578879
H  -0.982694 -2.734839 0.129152
H  1.870007 -0.259338 -1.268009
H  2.627976 0.90428 -0.112378
H  -2.144231 -1.149761 2.508839
H  -0.407419 -1.506761 2.244808
H  0.732682 1.856805 -0.658105
H  4.963201 -0.062079 -0.598638
H  4.248431 -1.203153 -1.757824
H  -3.181935 -1.553441 -0.379956
H  -3.915985 -2.336667 1.030124
H  -1.748261 4.843117 2.283172
H  -0.813658 6.146339 1.491721
H  -2.462189 5.752167 0.922734
H  5.165801 -3.156003 -0.407884
H  6.476029 -2.057976 -0.929505
H  5.885334 -2.009578 0.75665
H  -3.476436 -4.631478 -0.003579
H  -4.492531 -3.62113 -1.072434
H  -2.755241 -3.839226 -1.432374
