program: Gaussian 09
title: 000239295
version: EM64L-G09RevD.01
frameworkgroup: C1[X(C15H30N2O)]
method: RPBEPBE
basis: SDD
operation: Freq
keyword: #p
keyword: freq=noraman
keyword: PBEPBE/SDD
title: #p freq=noraman PBEPBE/SDD
converged: YES YES NO NO
title: Mulliken charges:
elementType: O N N C C C C C C C C C C C C C C C H H H H H H H H H H H H H H H H H H H H H H H H H H H H H H
charge: -0.329243 -0.404938 -0.122578 0.069350 -0.438580 -0.452227 -0.397798 -0.394583 -0.386367 0.255394 -0.329321 -0.376973 -0.476420 -0.327224 -0.341815 -0.344565 -0.688826 -0.689218 0.237259 0.231679 0.192923 0.198674 0.209573 0.197901 0.198333 0.199989 0.195142 0.187374 0.198271 0.298493 0.238785 0.200592 0.178311 0.210882 0.221535 0.140209 0.181578 0.202573 0.198717 0.195101 0.219143 0.175710 0.208388 0.217838 0.211839 0.211334 0.212661 0.205124
chargesum: 0.00000
title: Mulliken charges with hydrogens summed into heavy atoms:
elementType: O N N C C C C C C C C C C C C C C C
charge: -0.329243 -0.106445 -0.122578 0.306609 -0.013977 -0.043980 -0.001564 0.000548 -0.000722 0.255394 0.110056 0.012221 -0.114676 0.056927 0.052002 0.050288 -0.050761 -0.060099
polarizability: 2.03578152e+02 7.23554013e-01 1.92927494e+02 9.14703891e-01 -3.14075951e+00 1.51541008e+02
1716.lowfreq: -8.7175 -0.0005 -0.0003 -0.0001 1.7122 10.8219 14.5134 18.6756 32.8769
frequency: 10.7638 16.6548 32.8737 45.7367 51.2173 71.0912 76.2060 86.9854 89.8836 101.6163 141.0497 148.9958 179.8525 186.0374 210.0473 222.9993 226.5671 237.6288 262.1041 306.1341 320.1211 338.9452 359.1310 380.8042 426.5527 435.6972 440.8001 448.5147 500.5927 513.2175 611.5773 622.5058 652.7225 735.5176 737.2928 773.2752 788.5759 793.9444 807.6444 827.0731 842.8317 864.6041 884.0147 898.0628 900.8457 921.6974 934.8869 950.0805 955.2549 983.4662 1013.3303 1019.9205 1043.0368 1045.1314 1051.5218 1077.1213 1079.2463 1082.6404 1090.1973 1111.3971 1116.6447 1123.7099 1138.7381 1152.4206 1159.0195 1195.2785 1214.9247 1225.6167 1238.1163 1246.0173 1252.1248 1254.1857 1266.6711 1274.2236 1283.4353 1286.7362 1289.6363 1305.0992 1306.9131 1318.5461 1330.5824 1331.8995 1334.3575 1339.8119 1343.1708 1353.5328 1359.0590 1362.9665 1369.1661 1387.4263 1390.9531 1429.2040 1449.9370 1462.1773 1462.7365 1465.8683 1467.8295 1470.8833 1472.2667 1474.3140 1476.3189 1478.2779 1479.9503 1484.1646 1486.1322 1496.9567 1500.8748 1650.9908 2848.9555 2936.0163 2953.9693 2958.1347 2967.2784 2967.3835 2968.9850 2970.7466 2970.9518 2972.8575 2974.4985 2979.4473 2982.1102 3001.9553 3007.5666 3015.1436 3015.4318 3029.6224 3031.0342 3032.7514 3038.9653 3040.1533 3050.9883 3061.1157 3068.2573 3069.5704 3069.6059 3074.7321 3075.0445 3559.6891
redmass: 3.5078 3.0862 2.9675 2.8751 2.2708 2.8380 2.2594 2.8154 2.4357 2.1257 2.7942 2.7784 3.3315 3.1574 2.7799 1.6092 1.3437 1.1355 2.4214 2.8466 2.7041 2.8523 3.7654 2.6049 2.2369 1.8843 2.0172 2.3855 2.2960 2.0651 4.4054 3.4272 11.3354 1.1457 1.1273 2.4502 1.4466 1.2722 2.4763 1.8824 1.8222 1.7469 1.7571 1.5524 1.8170 1.7512 1.2491 1.4058 2.0677 2.6568 3.4320 3.8206 1.9267 2.9412 1.1177 2.3525 1.4813 2.3532 2.2248 2.6445 1.9842 2.1573 1.7674 2.2991 2.3592 1.4797 1.3826 1.3579 1.3211 1.2599 1.2826 1.3447 1.2815 1.3346 1.2446 1.1485 1.0748 1.3078 1.2660 1.8205 1.3576 1.3793 1.3951 1.4719 1.6474 1.6645 1.5232 1.4917 1.7111 1.2147 1.2157 1.4319 1.0946 1.0882 1.0878 1.0909 1.0724 1.0653 1.0820 1.0647 1.0433 1.0429 1.0969 1.0726 1.0706 1.0864 1.0963 6.3304 1.0702 1.0713 1.0625 1.0633 1.0619 1.0610 1.0632 1.0515 1.0489 1.0551 1.0405 1.0620 1.0639 1.0870 1.0958 1.0917 1.0857 1.0952 1.0986 1.1002 1.1022 1.1014 1.1012 1.1015 1.1007 1.0987 1.0987 1.0971 1.0973 1.0755
irintensity: 0.0191 0.0873 0.8770 0.0287 0.4998 0.6089 0.6541 0.4018 1.1598 0.4396 0.0056 1.7603 0.3456 1.5814 1.2695 0.1084 0.2560 0.0255 1.1557 1.8431 3.5340 1.3249 4.7834 5.7146 18.8146 30.6843 34.6438 3.1625 7.0916 6.7045 12.3336 7.3096 21.5959 12.8993 3.4978 7.8423 0.7446 0.3537 0.2222 0.9867 7.5324 3.5181 2.5871 18.5338 8.1333 0.2928 0.3218 2.5114 29.5497 14.4934 130.9738 2.0822 3.1838 5.3868 3.9197 7.0456 11.8556 14.1473 38.9368 0.6988 2.8658 8.0215 29.9582 5.4457 26.1968 3.8621 34.4720 2.4024 1.0002 8.4336 5.0482 32.8628 33.7619 39.6752 20.4142 1.8922 0.9583 0.1136 2.4249 187.7767 1.2672 35.4485 3.7500 1.7099 65.9908 17.2665 14.3813 3.8425 25.7671 11.8345 15.7756 9.6716 9.1022 3.8664 3.8102 11.8374 0.3806 3.7560 17.8679 1.8629 11.9376 12.9118 2.9567 10.8057 9.7179 6.6294 26.2249 566.2512 120.5712 72.9465 22.5050 29.7529 41.6483 30.3628 39.7756 10.0912 79.3642 65.7697 23.4906 9.8073 24.6633 78.4312 4.7834 4.2423 32.0043 63.7064 66.7543 33.1671 35.0492 41.6268 37.8681 59.7567 87.0690 26.4119 47.4865 66.7476 66.6351 10.3150
temp: 298.150 k
press: 1.00000 atm
elementType: 8 7 7 6 6 6 6 6 6 6 6 6 6 6 6 6 6 6 1 1 1 1 1 1 1 1 1 1 1 1 1 1 1 1 1 1 1 1 1 1 1 1 1 1 1 1 1 1
symmnumber: 1
zpe: 1132989.6 jmol-1
zpe.correction: 0.431533 hartree
zpe.thermalcorrener: 0.453333 hartree
zpe.thermalcorrenthalpy: 0.454277 hartree
zpe.thermalcorrgfe: 0.377111 hartree
zpe.sumelectzpe: -772.835447 hartree
zpe.sumelectthermal: -772.813647 hartree
zpe.sumelectthermalent: -772.812703 hartree
zpe.sumelectthermalfe: -772.889869 hartree
dipole: -1.6332 -0.5072 0.2476
dipole: 1.7280
quadrupole: -105.1207 -112.2987 -113.9804
quadrupole: -1.0322 3.2442 -1.4645
quadrupole: 5.3459 -1.8321 -3.5138 -1.0322 3.2442 -1.4645
hfenergy: -773.2669799 hartree
pointgroup: C01 [X(C15H30N2O1)]
dipole: -0.6464928 -0.1054601 -0.1819797 debye
polarizability: 201.0862974|3.9116456|194.7091652|6.8217597|-0.6124099|152.2511904 unknown
InChI: InChI=1S/C15H30N2O/c1-3-5-12-16-15(17-13-6-4-2)18-14-10-8-7-9-11-14/h14,16H,3-13H2,1-2H3
charge 0 multiplicity 1
48 atoms
O  0.075239 1.070615 0.636782
N  -1.469708 -0.623806 0.737457
N  0.836429 -1.019932 1.412276
C  1.483657 1.562514 0.712553
C  2.22827 1.216238 -0.589626
C  1.400248 3.077735 0.946447
C  3.648628 1.834317 -0.580822
C  2.821439 3.696952 0.957466
C  3.593309 3.362977 -0.342276
C  -0.141191 -0.277765 0.964177
C  -2.543558 0.298742 0.332801
C  -3.641437 -0.449686 -0.451767
C  0.644269 -2.432495 1.777182
C  1.250277 -3.390376 0.718996
C  -4.812425 0.474398 -0.855859
C  0.510062 -3.372721 -0.636342
C  -5.918966 -0.272753 -1.631235
C  1.168787 -4.293652 -1.685989
H  1.970553 1.049067 1.563299
H  2.279884 0.11782 -0.697045
H  1.650367 1.618253 -1.446247
H  0.799215 3.535711 0.135389
H  0.875039 3.279049 1.898803
H  4.249258 1.36055 0.223065
H  4.16156 1.610244 -1.53586
H  2.749097 4.793194 1.09295
H  3.38691 3.303999 1.827736
H  3.084448 3.847335 -1.201351
H  4.617415 3.781725 -0.295882
H  -1.740001 -1.575066 0.987681
H  -2.097983 1.092149 -0.289744
H  -2.995609 0.79863 1.217713
H  -4.039237 -1.284388 0.165223
H  -3.192875 -0.906967 -1.355979
H  1.169088 -2.60186 2.737814
H  -0.421825 -2.729879 1.951927
H  1.251325 -4.421801 1.129678
H  2.308693 -3.101777 0.562609
H  -4.422537 1.307579 -1.47463
H  -5.245048 0.937367 0.054233
H  0.480624 -2.333568 -1.017884
H  -0.54514 -3.683418 -0.482057
H  -6.343792 -1.093407 -1.02277
H  -6.746411 0.405475 -1.908666
H  -5.519706 -0.717828 -2.562027
H  2.210709 -3.979596 -1.886148
H  0.619897 -4.273752 -2.645698
H  1.198049 -5.34254 -1.333955
