program: Gaussian 09
title: 000239293
version: EM64L-G09RevD.01
frameworkgroup: C1[X(C8H14O6)]
method: RPBEPBE
basis: SDD
operation: Freq
keyword: #pfreq=noraman
keyword: PBEPBE/SDD
title: #p freq=noraman PBEPBE/SDD
converged: YES YES NO NO
title: Mulliken charges:
elementType: O O O O O O C C C C C C C C H H H H H H H H H H H H H H
charge: -0.281146 -0.230061 -0.221448 -0.199422 -0.480796 -0.439714 -0.086719 -0.090089 -0.041932 -0.157796 -0.379771 -0.224243 -0.210640 -0.326606 0.235787 0.214431 0.203429 0.260746 0.191017 0.262806 0.244057 0.182983 0.185549 0.243354 0.230862 0.181973 0.376442 0.356947
chargesum: 0.00000
title: Mulliken charges with hydrogens summed into heavy atoms:
elementType: O O O O O O C C C C C C C C
charge: -0.281146 -0.230061 -0.221448 -0.199422 -0.104353 -0.082767 0.149069 0.124342 0.161497 0.102950 0.074052 0.202796 0.218263 0.086228
polarizability: 1.17973217e+02 3.48548495e-01 1.06251440e+02 -1.92902008e+00 8.28144991e-01 8.31792317e+01
1716.lowfreq: -0.0006 -0.0004 0.0005 3.3574 11.3637 15.6485 47.3518 91.8621 98.8078
frequency: 47.2595 91.8539 98.7946 129.2773 145.5127 171.8361 230.0547 245.1168 278.9766 306.9298 335.0354 338.3305 378.1644 390.0007 479.3664 500.9207 511.5298 541.5066 560.3552 602.3722 637.4950 720.1214 757.9455 787.9616 811.7203 854.3263 858.9741 903.6333 920.3449 932.7776 942.9258 983.9692 990.7357 1029.4434 1035.1622 1042.9379 1055.3933 1074.7278 1100.3490 1117.8113 1126.2450 1153.0277 1172.7786 1209.0062 1220.5770 1252.2233 1258.6474 1272.5293 1284.7647 1298.5963 1310.0486 1323.2389 1327.7219 1341.6988 1345.6482 1358.6282 1376.6355 1385.1941 1391.5077 1396.8309 1441.1154 1450.0916 1452.1038 1462.9785 2889.4697 2891.5608 2906.6833 2914.2647 2939.6267 2946.9328 2958.3941 3026.4057 3089.8816 3110.5913 3136.2461 3136.9259 3491.9630 3520.4293
redmass: 5.4067 5.2145 3.4940 3.7491 7.0091 5.3354 4.6440 5.0070 4.8613 2.9176 4.5404 2.8207 4.1048 2.0623 3.4069 1.1519 5.9328 6.3455 4.2487 1.1818 3.8216 4.5391 5.1705 4.9031 3.5458 2.4680 3.8589 2.9365 6.4154 4.9831 6.3305 3.8536 3.6086 3.9635 3.7451 2.1439 2.9303 2.2407 2.0863 2.4482 1.9964 2.1151 1.2040 1.1384 1.0852 1.2176 1.2776 1.1999 1.3121 1.4372 1.2048 1.2391 1.5647 1.2457 1.3359 1.2545 1.2602 1.1831 1.2301 1.4626 1.0789 1.0943 1.1015 1.0848 1.0687 1.0693 1.0809 1.0805 1.0700 1.0751 1.0781 1.0849 1.0938 1.0947 1.0961 1.0958 1.0649 1.0649
irintensity: 0.9900 5.6133 4.5960 2.3396 1.6032 14.9360 1.0151 1.2386 4.8446 0.2944 4.7050 5.0683 9.1074 7.7316 8.0133 192.6798 17.4118 9.9584 1.0521 219.0811 13.5858 8.5288 12.2442 14.2694 7.7164 25.2713 6.4534 1.9827 28.7398 274.9201 161.8041 27.0345 10.3360 49.7557 105.5715 39.2471 50.7825 24.1233 10.8936 16.7906 37.5922 27.0706 16.9800 9.6305 3.4094 4.0098 19.5655 33.1320 24.4451 2.7660 0.6833 4.7284 4.4736 18.1465 1.8073 6.4811 73.7841 0.7893 4.1884 6.6571 8.2999 6.2561 9.4793 2.5799 116.5766 62.4133 5.2015 56.9757 70.1358 11.8655 134.2619 23.1299 19.6859 9.8741 15.2747 16.7005 66.7961 12.2124
temp: 298.150 k
press: 1.00000 atm
elementType: 8 8 8 8 8 8 6 6 6 6 6 6 6 6 1 1 1 1 1 1 1 1 1 1 1 1 1 1
symmnumber: 1
zpe: 595220.9 jmol-1
zpe.correction: 0.226708 hartree
zpe.thermalcorrener: 0.239658 hartree
zpe.thermalcorrenthalpy: 0.240602 hartree
zpe.thermalcorrgfe: 0.187441 hartree
zpe.sumelectzpe: -763.389769 hartree
zpe.sumelectthermal: -763.376819 hartree
zpe.sumelectthermalent: -763.375875 hartree
zpe.sumelectthermalfe: -763.429036 hartree
dipole: -3.2808 -0.1977 4.1904
dipole: 5.3256
quadrupole: -105.8072 -73.3003 -82.4797
quadrupole: 1.5295 -4.9132 3.3973
quadrupole: -18.6115 13.8954 4.7160 1.5295 -4.9132 3.3973
hfenergy: -763.6164768 hartree
pointgroup: C01 [X(C8H14O6)]
dipole: 1.2710396 -0.0720166 -1.6641295 debye
polarizability: 117.9269514|-0.229258|106.2334807|-2.3492172|-0.988881|83.2434567 unknown
InChI: InChI=1S/C8H14O6/c9-1-5(10)7-8-6(12-4-14-7)2-11-3-13-8/h5-10H,1-4H2
charge 0 multiplicity 1
28 atoms
O  0.60938 -1.242561 0.556036
O  -0.57262 1.615351 0.64743
O  1.811132 1.641322 0.262449
O  3.025457 -1.150352 0.469905
O  -1.988662 -1.650352 -0.32863
O  -4.446696 -0.510054 0.262817
C  0.463266 -0.305404 -0.581975
C  -0.800992 0.551515 -0.351388
C  1.723839 0.588161 -0.761889
C  -1.999812 -0.266245 0.184256
C  3.014726 -0.239582 -0.68825
C  0.582501 2.421155 0.291416
C  1.860972 -2.001667 0.444433
C  -3.352965 0.307504 -0.253444
H  0.323205 -0.904609 -1.509668
H  -1.043802 1.02646 -1.332168
H  1.654264 1.068997 -1.767393
H  -1.926844 -0.270636 1.288721
H  3.127182 -0.827245 -1.626362
H  3.882278 0.423575 -0.554776
H  0.703138 3.167243 1.087455
H  0.417292 2.891811 -0.70844
H  1.837453 -2.590535 -0.505249
H  1.911711 -2.643374 1.333697
H  -3.492646 1.319176 0.160335
H  -3.383547 0.355931 -1.365185
H  -1.224596 -2.10571 0.118397
H  -4.201118 -1.452773 0.064273
